RecurrenceIdentifier
type: Class
comment: Recurrence Identifier. Introduced to provide a structure for the value of ncal:recurrenceId property. See the documentation of ncal:recurrenceId for details.
subclass of: Resource

AttachmentEncoding
type: Class
comment: Attachment encoding. This class has been introduced to express the limited vocabulary of values for the ncal:encoding property. See the documentation of ncal:encoding for details.
subclass of: Resource

EventStatus
type: Class
comment: A status of an event. This class has been introduced to express the limited set of values for the ncal:status property. The user may use the instances provided with this ontology or create his/her own. See the documentation for ncal:eventStatus for details.
subclass of: Resource

RecurrenceFrequency
type: Class
comment: Frequency of a recurrence rule. This class has been introduced to express a limited set of allowed values for the ncal:freq property. See the documentation of ncal:freq for details.
subclass of: Resource

TimezoneObservance
type: Class
subclass of: UnionOfTimezoneObservanceEventFreebusyJournalTimezoneTodo
subclass of: UnionOfTimezoneObservanceEventFreebusyTimezoneTodo
subclass of: UnionOfTimezoneObservanceEventJournalTimezoneTodo

UnionOfTimezoneObservanceEventFreebusyJournalTimezoneTodo
type: Class
subclass of: UnionParentClass

UnionOfTimezoneObservanceEventFreebusyTimezoneTodo
type: Class
subclass of: UnionParentClass

UnionOfTimezoneObservanceEventJournalTimezoneTodo
type: Class
subclass of: UnionParentClass

UnionParentClass
type: Class
subclass of: Resource

Organizer
type: Class
comment: An organizer of an event. This class has been introduced to serve as a range of ncal:organizer property. See documentation of ncal:organizer for details.
subclass of: AttendeeOrOrganizer

AttendeeOrOrganizer
type: Class
comment: A common superclass for ncal:Attendee and ncal:Organizer.
subclass of: Resource

Event
type: Class
subclass of: UnionOfEventFreebusy
subclass of: UnionOfEventTodo
subclass of: UnionOfAlarmEventFreebusyTodo
subclass of: UnionOfTimezoneObservanceEventFreebusyJournalTimezoneTodo
subclass of: UnionOfAlarmEventJournalTodo
subclass of: InformationElement
subclass of: UnionOfEventFreebusyJournalTodo
subclass of: UnionOfTimezoneObservanceEventFreebusyTimezoneTodo
subclass of: UnionOfEventJournalTodo
subclass of: UnionOfTimezoneObservanceEventJournalTimezoneTodo
comment: Provide a grouping of component properties that describe an event.
subclass of: UnionOfAlarmEventTodo
subclass of: UnionOfEventJournalTimezoneTodo
subclass of: UnionOfAlarmEventFreebusyJournalTodo

UnionOfEventFreebusy
type: Class
subclass of: UnionParentClass

UnionOfEventTodo
type: Class
subclass of: UnionParentClass

UnionOfAlarmEventFreebusyTodo
type: Class
subclass of: UnionParentClass

UnionOfAlarmEventJournalTodo
type: Class
subclass of: UnionParentClass

UnionOfEventFreebusyJournalTodo
type: Class
subclass of: UnionParentClass

UnionOfEventJournalTodo
type: Class
subclass of: UnionParentClass

UnionOfAlarmEventTodo
type: Class
subclass of: UnionParentClass

UnionOfEventJournalTimezoneTodo
type: Class
subclass of: UnionParentClass

UnionOfAlarmEventFreebusyJournalTodo
type: Class
subclass of: UnionParentClass

Attachment
type: Class
comment: An object attached to a calendar entity. This class has been introduced to serve as a structured value of the ncal:attach property. See the documentation of ncal:attach for details.
subclass of: Attachment
subclass of: Resource

AccessClassification
type: Class
comment: Access classification of a calendar component. Introduced to express the set of values for the ncal:class property. The user may use instances provided with this ontology or create his/her own with desired semantics. See the documentation of ncal:class for details.
subclass of: Resource

CalendarDataObject
type: Class
comment: A DataObject found in a calendar. It is usually interpreted as one of the calendar entity types (e.g. Event, Journal, Todo etc.)
subclass of: DataObject

Todo
type: Class
subclass of: UnionOfEventFreebusyJournalTodo
subclass of: UnionOfTimezoneObservanceEventJournalTimezoneTodo
subclass of: UnionOfEventJournalTodo
subclass of: UnionOfAlarmEventFreebusyJournalTodo
comment: Provide a grouping of calendar properties that describe a to-do.
subclass of: UnionOfAlarmEventFreebusyTodo
subclass of: UnionOfTimezoneObservanceEventFreebusyJournalTimezoneTodo
subclass of: UnionOfEventJournalTimezoneTodo
subclass of: UnionOfAlarmEventTodo
subclass of: InformationElement
subclass of: UnionOfEventTodo
subclass of: UnionOfTimezoneObservanceEventFreebusyTimezoneTodo
subclass of: UnionOfAlarmEventJournalTodo

Freebusy
type: Class
subclass of: UnionOfTimezoneObservanceEventFreebusyJournalTimezoneTodo
subclass of: UnionOfAlarmEventFreebusyJournalTodo
subclass of: UnionOfEventFreebusyJournalTodo
subclass of: InformationElement
subclass of: UnionOfTimezoneObservanceEventFreebusyTimezoneTodo
comment: Provide a grouping of component properties that describe either a request for free/busy time, describe a response to a request for free/busy time or describe a published set of busy time.
subclass of: UnionOfAlarmEventFreebusyTodo
subclass of: UnionOfEventFreebusy

JournalStatus
type: Class
comment: A status of a journal entry. This class has been introduced to express the limited set of values for the ncal:status property. The user may use the instances provided with this ontology or create his/her own. See the documentation for ncal:journalStatus for details.
subclass of: Resource

RecurrenceIdentifierRange
type: Class
comment: Recurrence Identifier Range. This class has been created to provide means to express the limited set of values for the ncal:range property. See documentation for ncal:range for details.
subclass of: Resource

Journal
type: Class
subclass of: UnionOfEventJournalTodo
subclass of: UnionOfAlarmEventJournalTodo
subclass of: UnionOfEventFreebusyJournalTodo
subclass of: InformationElement
subclass of: UnionOfTimezoneObservanceEventFreebusyJournalTimezoneTodo
subclass of: UnionOfAlarmEventFreebusyJournalTodo
subclass of: UnionOfTimezoneObservanceEventJournalTimezoneTodo
comment: Provide a grouping of component properties that describe a journal entry.
subclass of: UnionOfEventJournalTimezoneTodo

Timezone
type: Class
comment: Provide a grouping of component properties that defines a time zone.
subclass of: InformationElement
subclass of: UnionOfEventJournalTimezoneTodo
subclass of: UnionOfTimezoneObservanceEventFreebusyJournalTimezoneTodo
subclass of: UnionOfTimezoneObservanceEventFreebusyTimezoneTodo
subclass of: UnionOfTimezoneObservanceEventJournalTimezoneTodo

Attendee
type: Class
comment: An attendee of an event. This class has been introduced to serve as the range for ncal:attendee property. See documentation of ncal:attendee for details.
subclass of: AttendeeOrOrganizer

NcalPeriod
type: Class
comment: A period of time. Inspired by the PERIOD datatype specified in RFC 2445 sec. 4.3.9
subclass of: NcalTimeEntity

NcalTimeEntity
type: Class
comment: A time entity. Conceived as a common superclass for NcalDateTime and NcalPeriod. According to RFC 2445 both DateTime and Period can be interpreted in different timezones. The first case is explored in many properties. The second case is theoretically possible in ncal:rdate property. Therefore the timezone properties have been defined at this level.
subclass of: Resource

Calendar
type: Class
comment: A calendar. Inspirations for this class can be traced to the VCALENDAR component defined in RFC 2445 sec. 4.4, but it may just as well be used to represent any kind of Calendar.
subclass of: InformationElement

FreebusyPeriod
type: Class
comment: An aggregate of a period and a freebusy type. This class has been introduced to serve as a range of the ncal:freebusy property. See documentation for ncal:freebusy for details. Note that the specification of freebusy property states that the period is to be expressed using UTC time, so the timezone properties should NOT be used for instances of this class.
subclass of: NcalPeriod

TriggerRelation
type: Class
comment: The relation between the trigger and its parent calendar component. This class has been introduced to express the limited vocabulary for the ncal:related property. See the documentation for ncal:related for more details.
subclass of: Resource

AlarmAction
type: Class
comment: Action to be performed on alarm. This class has been introduced to express the limited set of values of the ncal:action property. Please refer to the documentation of ncal:action for details.
subclass of: Resource

Alarm
type: Class
comment: Provide a grouping of component properties that define an alarm.
subclass of: InformationElement
subclass of: UnionOfAlarmEventFreebusyJournalTodo
subclass of: UnionOfAlarmEventFreebusyTodo
subclass of: UnionOfAlarmEventJournalTodo
subclass of: UnionOfAlarmEventTodo

RecurrenceRule
type: Class
subclass of: Resource

TodoStatus
type: Class
comment: A status of a calendar entity. This class has been introduced to express the limited set of values for the ncal:status property. The user may use the instances provided with this ontology or create his/her own. See the documentation for ncal:todoStatus for details.
subclass of: Resource

TimeTransparency
type: Class
comment: Time transparency. Introduced to provide a way to express the limited vocabulary for the values of ncal:transp property. See documentation of ncal:transp for details.
subclass of: Resource

CalendarScale
type: Class
comment: A calendar scale. This class has been introduced to provide the limited vocabulary for the ncal:calscale property.
subclass of: Resource

AttendeeRole
type: Class
comment: A role the attendee is going to play during an event. This class has been introduced to express the limited vocabulary for the values of ncal:role property. Please refer to the documentation of ncal:role for details.
subclass of: Resource

BydayRulePart
type: Class
comment: Expresses the compound value of a byday part of a recurrence rule. It stores the weekday and the integer modifier. Inspired by RFC 2445 sec. 4.3.10
subclass of: Resource

Weekday
type: Class
comment: Day of the week. This class has been created to provide the limited vocabulary for ncal:byday property. See the documentation for ncal:byday for details.
subclass of: Resource

Trigger
type: Class
comment: An alarm trigger. This class has been created to serve as the range of ncal:trigger property. See the documentation for ncal:trigger for more details.
subclass of: Resource

FreebusyType
type: Class
comment: Type of a Freebusy indication. This class has been introduced to serve as a limited set of values for the ncal:fbtype property. See the documentation of ncal:fbtype for details.
subclass of: Resource

CalendarUserType
type: Class
comment: A calendar user type. This class has been introduced to express the limited vocabulary for the ncal:cutype property. See documentation of ncal:cutype for details.
subclass of: Resource

NcalDateTime
type: Class
subclass of: NcalTimeEntity

ParticipationStatus
type: Class
comment: Participation Status. This class has been introduced to express the limited vocabulary of values for the ncal:partstat property. See the documentation of ncal:partstat for details.
subclass of: Resource

RequestStatus
type: Class
comment: Request Status. A class that was introduced to provide a structure for the value of ncal:requestStatus property. See documentation for ncal:requestStatus for details.
subclass of: Resource

attach
type: Property
comment: The property provides the capability to associate a document object with a calendar component. Defined in the RFC 2445 sec. 4.8.1.1
sub property of: hasPart
range: Attachment
domain: UnionOfAlarmEventJournalTodo

percentComplete
type: Property
comment: This property is used by an assignee or delegatee of a to-do to convey the percent completion of a to-do to the Organizer. Inspired by RFC 2445 sec. 4.8.1.8
domain: Todo
range: integer

delegatedTo
type: Property
comment: To specify the calendar users to whom the calendar user specified by the property has delegated participation. Inspired by RFC 2445 sec. 4.2.5. Originally the value type for this parameter was CAL-ADDRESS. This has been expressed as nco:Contact to promote integration between NCAL and NCO.
range: Contact
domain: Attendee

action
type: Property
comment: This property defines the action to be invoked when an alarm is triggered. Inspired by RFC 2445 sec 4.8.6.1. Originally this property had a limited set of values. They are expressed as instances of the AlarmAction class.
domain: Alarm
range: AlarmAction

ncalTimezone
type: Property
comment: The timezone instance that should be used to interpret an NcalDateTime. The purpose of this property is similar to the TZID parameter specified in RFC 2445 sec. 4.2.19
domain: NcalDateTime
range: Timezone

lastModified
type: Property
comment: The property specifies the date and time that the information associated with the calendar component was last revised in the calendar store. Note: This is analogous to the modification date and time for a file in the file system. Inspired by RFC 2445 sec. 4.8.7.3. Note that the RFC allows ONLY UTC time values for this property.
domain: UnionOfEventJournalTimezoneTodo
range: dateTime

delegatedFrom
type: Property
comment: To specify the calendar users that have delegated their participation to the calendar user specified by the property. Inspired by RFC 2445 sec. 4.2.4. Originally the value type for this property was CAL-ADDRESS. This has been expressed as nco:Contact to promote integration between NCAL and NCO.
range: Contact
domain: Attendee

trigger
type: Property
comment: This property specifies when an alarm will trigger. Inspired by RFC 2445 sec. 4.8.6.3 Originally the value of this property could accept two types : duration and date-time. To express this fact a Trigger class has been introduced. It also has a related property to account for the RELATED parameter.
range: Trigger
domain: UnionOfAlarmEventTodo

related
type: Property
comment: To specify the relationship of the alarm trigger with respect to the start or end of the calendar component. Inspired by RFC 2445 4.2.14. The RFC has specified two possible values for this property ('START' and 'END') they have been expressed as instances of the TriggerRelation class.
domain: Trigger
range: TriggerRelation

until
type: Property
comment: The UNTIL rule part defines a date-time value which bounds the recurrence rule in an inclusive manner. If the value specified by UNTIL is synchronized with the specified recurrence, this date or date-time becomes the last instance of the recurrence. If specified as a date-time value, then it MUST be specified in an UTC time format. If not present, and the COUNT rule part is also not present, the RRULE is considered to repeat forever.
domain: RecurrenceRule
range: dateTime

relatedToChild
type: Property
comment: The property is used to represent a relationship or reference between one calendar component and another. Inspired by RFC 2445 sec. 4.8.4.5. Originally this property had a RELTYPE parameter. It has been decided to introduce three different properties to express the values of that parameter. This property expresses the RELATED-TO property with RELTYPE=CHILD parameter.
domain: UnionOfEventJournalTodo
range: string
sub property of: ncalRelation

ncalRelation
type: Property
comment: A common superproperty for all types of ncal relations. It is not to be used directly.
sub property of: relation
domain: UnionOfEventJournalTodo
range: string

created
type: Property
comment: This property specifies the date and time that the calendar information was created by the calendar user agent in the calendar store. Note: This is analogous to the creation date and time for a file in the file system. Inspired by RFC 2445 sec. 4.8.7.1. Note that this property is a subproperty of nie:created. The domain of nie:created is nie:DataObject. It is not a superclass of UnionOf_Vevent_Vjournal_Vtodo, but since that union is conceived as an 'abstract' class, and in real-life all resources referenced by this property will also be DataObjects, than this shouldn't cause too much of a problem. Note that RFC allows ONLY UTC time values for this property.
sub property of: created
domain: UnionOfEventJournalTodo
range: dateTime

url
type: Property
comment: This property defines a Uniform Resource Locator (URL) associated with the iCalendar object. Inspired by the RFC 2445 sec. 4.8.4.6. Original range had been specified as URI.
domain: UnionOfEventFreebusyJournalTodo
range: Resource

comment
type: Property
comment: Non-processing information intended to provide a comment to the calendar user. Inspired by RFC 2445 sec. 4.8.1.4 with the following reservations: the LANGUAGE parameter has been discarded. Please use xml:lang literals to express language. For the ALTREP parameter use the commentAltRep property.
domain: UnionOfTimezoneObservanceEventFreebusyJournalTimezoneTodo
range: string

summaryAltRep
type: Property
comment: Alternate representation of the comment. Introduced to cover the ALTREP parameter of the SUMMARY property. See documentation of ncal:summary for details.
domain: UnionOfAlarmEventJournalTodo
range: Resource

completed
type: Property
comment: This property defines the date and time that a to-do was actually completed. Inspired by RFC 2445 sec. 4.8.2.1. Note that the RFC allows ONLY UTC time values for this property.
domain: Todo
range: dateTime

component
type: Property
comment: Links the Vcalendar instance with the calendar components. This property has no direct equivalent in the RFC specification. It has been introduced to express the containmnent relations.
domain: Calendar
range: CalendarDataObject
sub property of: hasPart

cutype
type: Property
comment: To specify the type of calendar user specified by the property. Inspired by RFC 2445 sec. 4.2.3. This parameter has a limited vocabulary. The terms that may serve as values for this property have been expressed as instances of CalendarUserType class. The user may use instances provided with this ontology or create his own.
domain: Attendee
range: CalendarUserType

priority
type: Property
comment: The property defines the relative priority for a calendar component. Inspired by RFC 2445 sec. 4.8.1.9
domain: UnionOfEventTodo
range: integer

relatedToParent
type: Property
comment: The property is used to represent a relationship or reference between one calendar component and another. Inspired by RFC 2445 sec. 4.8.4.5. Originally this property had a RELTYPE parameter. It has been decided that it is more natural to introduce three different properties to express the values of that parameter. This property expresses the RELATED-TO property with no RELTYPE parameter (the default value is PARENT), or with explicit RELTYPE=PARENT parameter.
domain: UnionOfEventJournalTodo
range: string
sub property of: ncalRelation

resources
type: Property
comment: Defines the equipment or resources anticipated for an activity specified by a calendar entity. Inspired by RFC 2445 sec. 4.8.1.10 with the following reservations: the LANGUAGE parameter has been discarded. Please use xml:lang literals to express language. For the ALTREP parameter use the resourcesAltRep property. This property specifies multiple resources. The order is not important. it is recommended to introduce a separate triple for each resource.
domain: UnionOfEventTodo
range: string

bysecond
type: Property
comment: Second of a recurrence. Defined in RFC 2445 sec. 4.3.10
domain: RecurrenceRule
range: integer

wkst
type: Property
comment: The day that's counted as the start of the week. It is used to disambiguate the byweekno rule. Defined in RFC 2445 sec. 4.3.10
domain: RecurrenceRule
range: Weekday

tzurl
type: Property
comment: The TZURL provides a means for a VTIMEZONE component to point to a network location that can be used to retrieve an up-to- date version of itself. Inspired by RFC 2445 sec. 4.8.3.5. Originally the range of this property had been specified as URI.
domain: Timezone
range: Resource

statusDescription
type: Property
comment: Longer return status description. Inspired by the second part of the structured value of the REQUEST-STATUS property defined in RFC 2445 sec. 4.8.8.2
domain: RequestStatus
range: string

location
type: Property
comment: Defines the intended venue for the activity defined by a calendar component. Inspired by RFC 2445 sec 4.8.1.7 with the following reservations: the LANGUAGE parameter has been discarded. Please use xml:lang literals to express language. For the ALTREP parameter use the locationAltRep property.
domain: UnionOfEventTodo
range: string

status
type: Property
comment: Defines the overall status or confirmation for an Event. Based on the STATUS property defined in RFC 2445 sec. 4.8.1.11.
range: EventStatus
domain: Event

bydayModifier
type: Property
comment: A n integer modifier for the BYDAY rule part. Each BYDAY value can also be preceded by a positive (+n) or negative (-n) integer. If present, this indicates the nth occurrence of the specific day within the MONTHLY or YEARLY RRULE. For example, within a MONTHLY rule, +1MO (or simply 1MO) represents the first Monday within the month, whereas -1MO represents the last Monday of the month. If an integer modifier is not present, it means all days of this type within the specified frequency. For example, within a MONTHLY rule, MO represents all Mondays within the month. Inspired by RFC 2445 sec. 4.3.10
domain: BydayRulePart
range: integer

uid
type: Property
comment: This property defines the persistent, globally unique identifier for the calendar component. Inspired by the RFC 2445 sec 4.8.4.7
sub property of: identifier
domain: UnionOfEventFreebusyJournalTodo
range: string

standard
type: Property
comment: Links the timezone with the standard timezone observance. This property has no direct equivalent in the RFC 2445. It has been inspired by the structure of the Vtimezone component defined in sec.4.6.5
domain: Timezone
range: TimezoneObservance

method
type: Property
comment: This property defines the iCalendar object method associated with the calendar object. Defined in RFC 2445 sec. 4.7.2
domain: Calendar
range: string

triggerDateTime
type: Property
comment: The exact date and time of the trigger. This property has been created to express the VALUE=DATE, and VALUE=DATE-TIME parameters of the TRIGGER property. See the documentation for ncal:trigger for more details
domain: Trigger
range: dateTime

dir
type: Property
comment: Specifies a reference to a directory entry associated with the calendar user specified by the property. Inspired by RFC 2445 sec. 4.2.6. Originally the data type of the value of this parameter was URI (Usually an LDAP URI). This has been expressed as rdfs:resource.
domain: AttendeeOrOrganizer
range: Resource

interval
type: Property
comment: The INTERVAL rule part contains a positive integer representing how often the recurrence rule repeats. The default value is "1", meaning every second for a SECONDLY rule, or every minute for a MINUTELY rule, every hour for an HOURLY rule, every day for a DAILY rule, every week for a WEEKLY rule, every month for a MONTHLY rule andevery year for a YEARLY rule. Defined in RFC 2445 sec. 4.3.10
domain: RecurrenceRule
range: integer

requestStatus
type: Property
comment: This property defines the status code returned for a scheduling request. Inspired by RFC 2445 sec. 4.8.8.2. Original value of this property was a four-element structure. The RequestStatus class has been introduced to express it. In RFC 2445 this property could have the LANGUAGE parameter. This has been discarded in this ontology. Use xml:lang literals to express it if necessary.
range: RequestStatus
domain: UnionOfEventFreebusyJournalTodo

byday
type: Property
comment: Weekdays the recurrence should occur. Defined in RFC 2445 sec. 4.3.10
range: BydayRulePart
domain: RecurrenceRule

recurrenceId
type: Property
comment: This property is used in conjunction with the "UID" and "SEQUENCE" property to identify a specific instance of a recurring "VEVENT", "VTODO" or "VJOURNAL" calendar component. The property value is the effective value of the "DTSTART" property of the recurrence instance. Inspired by the RFC 2445 sec. 4.8.4.4
range: RecurrenceIdentifier
domain: UnionOfEventJournalTimezoneTodo

attachmentUri
type: Property
comment: The uri of the attachment. Created to express the actual value of the ATTACH property defined in RFC 2445 sec. 4.8.1.1. This property expresses the default URI datatype of that property. see ncal:attachmentContents for the BINARY datatype.
domain: Attachment
range: Resource

periodBegin
type: Property
comment: Beginng of a period. Inspired by the first part of a structured value of the PERIOD datatype specified in RFC 2445 sec. 4.3.9
domain: NcalPeriod
range: dateTime

byweekno
type: Property
comment: The number of the week an event should recur. Defined in RFC 2445 sec. 4.3.10
domain: RecurrenceRule
range: integer

member
type: Property
comment: To specify the group or list membership of the calendar user specified by the property. Inspired by RFC 2445 sec. 4.2.11. Originally this parameter had a value type of CAL-ADDRESS. This has been expressed as nco:Contact to promote integration between NCAL and NCO
range: Contact
domain: Attendee

periodDuration
type: Property
comment: Duration of a period of time. Inspired by the second part of a structured value of the PERIOD datatype specified in RFC 2445 sec. 4.3.9. Note that a single NcalPeriod instance shouldn't have the periodEnd and periodDuration properties specified simultaneously.
domain: NcalPeriod
range: duration

dtstamp
type: Property
comment: The property indicates the date/time that the instance of the iCalendar object was created. Inspired by RFC 2445 sec. 4.8.7.1. Note that the RFC allows ONLY UTC values for this property.
domain: UnionOfEventFreebusyJournalTodo
range: dateTime

tzoffsetfrom
type: Property
comment: This property specifies the offset which is in use prior to this time zone observance. Inspired by RFC 2445 sec. 4.8.3.3. The original domain was underspecified. It said that this property must appear within a Timezone component. In this ontology a TimezoneObservance class has been introduced to clarify this specification. The original range was UTC-OFFSET. There is no equivalent among the XSD datatypes so plain string was chosen.
domain: TimezoneObservance
range: string

triggerDuration
type: Property
comment: The duration of a trigger. This property has been created to express the VALUE=DURATION parameter of the TRIGGER property. See documentation for ncal:trigger for more details.
domain: Trigger
range: duration

class
type: Property
comment: Defines the access classification for a calendar component. Inspired by RFC 2445 sec. 4.8.1.3 with the following reservations: this property has limited vocabulary. Possible values are: PUBLIC, PRIVATE and CONFIDENTIAL. The default is PUBLIC. Those values are expressed as instances of the AccessClassification class. The user may create his/her own if necessary.
range: AccessClassification
domain: UnionOfEventJournalTodo

organizer
type: Property
comment: The property defines the organizer for a calendar component. Inspired by RFC 2445 sec. 4.8.4.3. Originally this property accepted many parameters. The Organizer class has been introduced to express them all. Note that NCAL is aligned with NCO. The actual value (of the CAL-ADDRESS type) is expressed as an instance of nco:Contact. Remember that the CN parameter has been removed from NCAL. Instead that value should be expressed using nco:fullname property of the above mentioned nco:Contact instance.
range: Organizer
domain: UnionOfEventFreebusyJournalTodo

calscale
type: Property
comment: This property defines the calendar scale used for the calendar information specified in the iCalendar object. Defined in RFC 2445 sec. 4.7.1
domain: Calendar
range: CalendarScale

periodEnd
type: Property
comment: End of a period of time. Inspired by the second part of a structured value of a PERIOD datatype specified in RFC 2445 sec. 4.3.9. Note that a single NcalPeriod instance shouldn't have the periodEnd and periodDuration properties specified simultaneously.
domain: NcalPeriod
range: dateTime

transp
type: Property
comment: Defines whether an event is transparent or not to busy time searches. Inspired by RFC 2445 sec.4.8.2.7. Values for this property can be chosen from a limited vocabulary. To express this a TimeTransparency class has been introduced.
domain: Event
range: TimeTransparency

attendee
type: Property
comment: The property defines an "Attendee" within a calendar component. Inspired by RFC 2445 sec. 4.8.4.1. Originally this property accepted many parameters. The Attendee class has been introduced to express them all. Note that NCAL is aligned with NCO. The actual value (of the CAL-ADDRESS type) is expressed as an instance of nco:Contact. Remember that the CN parameter has been removed from NCAL. Instead that value should be expressed using nco:fullname property of the above mentioned nco:Contact instance. The RFC stated that whenever this property is attached to a Valarm instance, the Attendee cannot have any parameters apart from involvedContact.
range: Attendee
domain: UnionOfAlarmEventFreebusyJournalTodo

bydayWeekday
type: Property
comment: Connects a BydayRulePath with a weekday.
domain: BydayRulePart
range: Weekday

date
type: Property
comment: Date an instance of NcalDateTime refers to. It was conceived to express values in DATE datatype specified in RFC 2445 4.3.4
domain: NcalDateTime
range: date

rrule
type: Property
comment: This property defines a rule or repeating pattern for recurring events, to-dos, or time zone definitions. sec. 4.8.5.4
range: RecurrenceRule
domain: UnionOfTimezoneObservanceEventJournalTimezoneTodo

dtend
type: Property
comment: This property specifies the date and time that a calendar component ends. Inspired by RFC 2445 sec. 4.8.2.2
range: NcalDateTime
domain: UnionOfEventFreebusy

dateTime
type: Property
comment: Representation of a date an instance of NcalDateTime actually refers to. It's purpose is to express values in DATE-TIME datatype, as defined in RFC 2445 sec. 4.3.5
domain: NcalDateTime
range: dateTime

tzoffsetto
type: Property
comment: This property specifies the offset which is in use in this time zone observance. nspired by RFC 2445 sec. 4.8.3.4. The original domain was underspecified. It said that this property must appear within a Timezone component. In this ontology a TimezoneObservance class has been introduced to clarify this specification. The original range was UTC-OFFSET. There is no equivalent among the XSD datatypes so plain string was chosen.
domain: TimezoneObservance
range: string

prodid
type: Property
comment: This property specifies the identifier for the product that created the iCalendar object. Defined in RFC 2445 sec. 4.7.2
sub property of: generator
domain: Calendar
range: string

bymonthday
type: Property
comment: Day of the month when the event should recur. Defined in RFC 2445 sec. 4.3.10
domain: RecurrenceRule
range: integer

exdate
type: Property
comment: This property defines the list of date/time exceptions for a recurring calendar component. Inspired by RFC 2445 sec. 4.8.5.1
range: NcalDateTime
domain: UnionOfEventJournalTimezoneTodo

summary
type: Property
comment: Defines a short summary or subject for the calendar component. Inspired by RFC 2445 sec 4.8.1.12 with the following reservations: the LANGUAGE parameter has been discarded. Please use xml:lang literals to express language. For the ALTREP parameter use the summaryAltRep property.
domain: UnionOfAlarmEventJournalTodo
range: string

role
type: Property
comment: To specify the participation role for the calendar user specified by the property. Inspired by the RFC 2445 sec. 4.2.16. Originally this property had a limited vocabulary for values. The terms of that vocabulary have been expressed as instances of the AttendeeRole class.
domain: Attendee
range: AttendeeRole

fbtype
type: Property
comment: To specify the free or busy time type. Inspired by RFC 2445 sec. 4.2.9. The RFC specified a limited vocabulary for the values of this property. The terms of this vocabulary have been expressed as instances of the FreebusyType class. The user can use instances provided with this ontology or create his own.
domain: FreebusyPeriod
range: FreebusyType

tzname
type: Property
comment: Specifies the customary designation for a timezone description. Inspired by RFC 2445 sec. 4.8.3.2 The LANGUAGE parameter has been discarded. Please xml:lang literals to express languages. Original specification for the domain of this property stated that it must appear within the timezone component. In this ontology the TimezoneObservance class has been itroduced to clarify this specification.
domain: TimezoneObservance
range: string

descriptionAltRep
type: Property
comment: Alternate representation of the calendar entity description. Introduced to cover the ALTREP parameter of the DESCRIPTION property. See documentation of ncal:description for details.
domain: UnionOfAlarmEventJournalTodo
range: Resource

commentAltRep
type: Property
comment: Alternate representation of the comment. Introduced to cover the ALTREP parameter of the COMMENT property. See documentation of ncal:comment for details.
domain: UnionOfTimezoneObservanceEventFreebusyJournalTimezoneTodo
range: Resource

freebusy
type: Property
comment: The property defines one or more free or busy time intervals. Inspired by RFC 2445 sec. 4.8.2.6. Note that the periods specified by this property can only be expressed with UTC times. Originally this property could have many comma-separated values. Please use a separate triple for each value.
domain: Freebusy
range: FreebusyPeriod

version
type: Property
comment: This property specifies the identifier corresponding to the highest version number or the minimum and maximum range of the iCalendar specification that is required in order to interpret the iCalendar object. Defined in RFC 2445 sec. 4.7.4
sub property of: generatorOption
domain: Calendar
range: string

range
type: Property
comment: To specify the effective range of recurrence instances from the instance specified by the recurrence identifier specified by the property. It is intended to express the RANGE parameter specified in RFC 2445 sec. 4.2.13. The set of possible values for this property is limited. See also the documentation for ncal:recurrenceId for more details.
domain: RecurrenceIdentifier
range: RecurrenceIdentifierRange

status
type: Property
comment: Defines the overall status or confirmation for a todo. Based on the STATUS property defined in RFC 2445 sec. 4.8.1.11.
range: TodoStatus
domain: Todo

status
type: Property
comment: Defines the overall status or confirmation for a journal entry. Based on the STATUS property defined in RFC 2445 sec. 4.8.1.11.
range: JournalStatus
domain: Journal

sequence
type: Property
comment: This property defines the revision sequence number of the calendar component within a sequence of revisions. Inspired by RFC 2445 sec. 4.8.7.4
domain: UnionOfEventJournalTodo
range: integer

contact
type: Property
comment: The property is used to represent contact information or alternately a reference to contact information associated with the calendar component. Inspired by RFC 2445 sec. 4.8.4.2 with the following reservations: the LANGUAGE parameter has been discarded. Please use xml:lang literals to express language. For the ALTREP parameter use the contactAltRep property.RFC doesn't define any format for the string.
domain: UnionOfEventFreebusyJournalTodo
range: string

repeat
type: Property
comment: This property defines the number of time the alarm should be repeated, after the initial trigger. Inspired by RFC 2445 sec. 4.8.6.2
domain: Alarm
range: integer

bysetpos
type: Property
comment: The BYSETPOS rule part specify values which correspond to the nth occurrence within the set of events specified by the rule. Valid values are 1 to 366 or -366 to -1. It MUST only be used in conjunction with another BYxxx rule part. For example "the last work day of the month" could be represented as: RRULE: FREQ=MONTHLY; BYDAY=MO, TU, WE, TH, FR; BYSETPOS=-1. Each BYSETPOS value can include a positive (+n) or negative (-n) integer. If present, this indicates the nth occurrence of the specific occurrence within the set of events specified by the rule. Defined in RFC 2445 sec. 4.3.10
domain: RecurrenceRule
range: integer

due
type: Property
comment: This property defines the date and time that a to-do is expected to be completed. Inspired by RFC 2445 sec. 4.8.2.3
range: NcalDateTime
domain: Todo

contactAltRep
type: Property
comment: Alternate representation of the contact property. Introduced to cover the ALTREP parameter of the CONTACT property. See documentation of ncal:contact for details.
domain: UnionOfEventFreebusyJournalTodo
range: Resource

rdate
type: Property
comment: This property defines the list of date/times for a recurrence set. Inspired by RFC 2445 sec. 4.8.5.3. Note that RFC allows both DATE, DATE-TIME and PERIOD values for this property. That's why the range has been set to NcalTimeEntity.
range: NcalTimeEntity
domain: UnionOfTimezoneObservanceEventJournalTimezoneTodo

recurrenceIdDateTime
type: Property
comment: The date and time of a recurrence identifier. Provided to express the actual value of the ncal:recurrenceId property. See documentation for ncal:recurrenceId for details.
range: NcalDateTime
domain: RecurrenceIdentifier

returnStatus
type: Property
comment: Short return status. Inspired by the first element of the structured value of the REQUEST-STATUS property described in RFC 2445 sec. 4.8.8.2. The short return status is a PERIOD character (US-ASCII decimal 46) separated 3-tuple of integers. For example, "3.1.1". The successive levels of integers provide for a successive level of status code granularity. The following are initial classes for the return status code. Individual iCalendar object methods will define specific return status codes for these classes. In addition, other classes for the return status code may be defined using the registration process defined later in this memo. 1.xx - Preliminary success. This class of status of status code indicates that the request has request has been initially processed but that completion is pending. 2.xx -Successful. This class of status code indicates that the request was completed successfuly. However, the exact status code can indicate that a fallback has been taken. 3.xx - Client Error. This class of status code indicates that the request was not successful. The error is the result of either a syntax or a semantic error in the client formatted request. Request should not be retried until the condition in the request is corrected. 4.xx - Scheduling Error. This class of status code indicates that the request was not successful. Some sort of error occurred within the calendaring and scheduling service, not directly related to the request itself.
domain: RequestStatus
range: string

daylight
type: Property
comment: Links a timezone with it's daylight observance. This property has no direct equivalent in the RFC 2445. It has been inspired by the structure of the Vtimezone component defined in sec.4.6.5
domain: Timezone
range: TimezoneObservance

locationAltRep
type: Property
comment: Alternate representation of the event or todo location. Introduced to cover the ALTREP parameter of the LOCATION property. See documentation of ncal:location for details.
domain: UnionOfEventTodo
range: Resource

involvedContact
type: Property
comment: A contact of the Attendee or the organizer involved in an event or other calendar entity. This property has been introduced to express the actual value of the ATTENDEE and ORGANIZER properties. The contact will also represent the CN parameter of those properties. See documentation of ncal:attendee or ncal:organizer for more details.
range: Contact
domain: AttendeeOrOrganizer

hasAlarm
type: Property
comment: Links an event or a todo with a DataObject that can be interpreted as an alarm. This property has no direct equivalent in the RFC 2445. It has been provided to express this relation.
range: CalendarDataObject
domain: UnionOfEventTodo
sub property of: hasPart

exrule
type: Property
comment: This property defines a rule or repeating pattern for an exception to a recurrence set. Inspired by RFC 2445 sec. 4.8.5.2.
range: RecurrenceRule
domain: UnionOfEventJournalTodo

rsvp
type: Property
comment: To specify whether there is an expectation of a favor of a reply from the calendar user specified by the property value. Inspired by RFC 2445 sec. 4.2.17
domain: Attendee
range: boolean

byhour
type: Property
comment: Hour of recurrence. Defined in RFC 2445 sec. 4.3.10
domain: RecurrenceRule
range: integer

geo
type: Property
comment: This property specifies information related to the global position for the activity specified by a calendar component. Inspired by RFC 2445 sec. 4.8.1.6
domain: UnionOfEventTodo
range: Point

byminute
type: Property
comment: Minute of recurrence. Defined in RFC 2445 sec. 4.3.10
domain: RecurrenceRule
range: integer

resourcesAltRep
type: Property
comment: Alternate representation of the resources needed for an event or todo. Introduced to cover the ALTREP parameter of the resources property. See documentation for ncal:resources for details.
domain: UnionOfEventTodo
range: Resource

fmttype
type: Property
comment: To specify the content type of a referenced object. Inspired by RFC 2445 sec. 4.2.8. The value of this property should be an IANA-registered content type (e.g. application/binary)
domain: Attachment
range: string

byyearday
type: Property
comment: Day of the year the event should occur. Defined in RFC 2445 sec. 4.3.10
domain: RecurrenceRule
range: integer

dtstart
type: Property
comment: This property specifies when the calendar component begins. Inspired by RFC 2445 sec. 4.8.2.4
range: NcalDateTime
domain: UnionOfTimezoneObservanceEventFreebusyTimezoneTodo

description
type: Property
comment: A more complete description of the calendar component, than that provided by the ncal:summary property.Inspired by RFC 2445 sec. 4.8.1.5 with following reservations: the LANGUAGE parameter has been discarded. Please use xml:lang literals to express language. For the ALTREP parameter use the descriptionAltRep property.
sub property of: description
domain: UnionOfAlarmEventJournalTodo
range: string

encoding
type: Property
comment: To specify an alternate inline encoding for the property value. Inspired by RFC 2445 sec. 4.2.7. Originally this property had a limited vocabulary. ('8BIT' and 'BASE64'). The terms of this vocabulary have been expressed as instances of the AttachmentEncoding class
domain: Attachment
range: AttachmentEncoding

requestStatusData
type: Property
comment: Additional data associated with a request status. Inspired by the third part of the structured value for the REQUEST-STATUS property defined in RFC 2445 sec. 4.8.8.2 ("Textual exception data. For example, the offending property name and value or complete property line")
domain: RequestStatus
range: string

partstat
type: Property
comment: To specify the participation status for the calendar user specified by the property. Inspired by RFC 2445 sec. 4.2.12. Originally this parameter had three sets of allowed values. Which set applied to a particular case - depended on the type of calendar entity this parameter occured in. (event, todo, journal entry). This would be awkward to model in RDF so a single ParticipationStatus class has been introduced. Terms of the values vocabulary are expressed as instances of this class. Users are advised to pay attention which instances they use.
domain: Attendee
range: ParticipationStatus

relatedToSibling
type: Property
comment: The property is used to represent a relationship or reference between one calendar component and another. Inspired by RFC 2445 sec. 4.8.4.5. Originally this property had a RELTYPE parameter. It has been decided that it is more natural to introduce three different properties to express the values of that parameter. This property expresses the RELATED-TO property with RELTYPE=SIBLING parameter.
domain: UnionOfEventJournalTodo
range: string
sub property of: ncalRelation

count
type: Property
comment: How many times should an event be repeated. Defined in RFC 2445 sec. 4.3.10
domain: RecurrenceRule
range: integer

tzid
type: Property
comment: This property specifies the text value that uniquely identifies the "VTIMEZONE" calendar component. Inspired by RFC 2445 sec 4.8.3.1
domain: Timezone
range: string

duration
type: Property
comment: The property specifies a positive duration of time. Inspired by RFC 2445 sec. 4.8.2.5
domain: UnionOfAlarmEventFreebusyTodo
range: duration

bymonth
type: Property
comment: Number of the month of the recurrence. Valid values are integers from 1 (January) to 12 (December). Defined in RFC 2445 sec. 4.3.10
domain: RecurrenceRule
range: integer

categories
type: Property
comment: Categories for a calendar component. Inspired by RFC 2445 sec 4.8.1.2 with the following reservations: The LANGUAGE parameter has been discarded. Please use xml:lang literals to express multiple languages. This property can specify multiple comma-separated categories. The order of categories doesn't matter. Please use a separate triple for each category.
domain: UnionOfEventJournalTodo
range: string

sentBy
type: Property
comment: To specify the calendar user that is acting on behalf of the calendar user specified by the property. Inspired by RFC 2445 sec. 4.2.18. The original data type of this property was a mailto: URI. This has been changed to nco:Contact to promote integration between NCO and NCAL.
range: Contact
domain: AttendeeOrOrganizer

freq
type: Property
comment: Frequency of a recurrence rule. Defined in RFC 2445 sec. 4.3.10
range: RecurrenceFrequency
domain: RecurrenceRule

attachmentContent
type: Property
comment: The uri of the attachment. Created to express the actual value of the ATTACH property defined in RFC 2445 sec. 4.8.1.1. This property expresses the BINARY datatype of that property. see ncal:attachmentUri for the URI datatype.
domain: Attachment
range: string

sunday
type: Weekday

base64Encoding
type: AttachmentEncoding

completedParticipationStatus
type: ParticipationStatus

needsActionStatus
type: TodoStatus

acceptedParticipationStatus
type: ParticipationStatus

displayAction
type: AlarmAction

wednesday
type: Weekday

resourceUserType
type: CalendarUserType

cancelledEventStatus
type: EventStatus

cancelledTodoStatus
type: TodoStatus

individualUserType
type: CalendarUserType

completedStatus
type: TodoStatus

procedureAction
type: AlarmAction

_8bitEncoding
type: AttachmentEncoding

delegatedParticipationStatus
type: ParticipationStatus

busyTentativeFreebusyType
type: FreebusyType

emailAction
type: AlarmAction

needsActionParticipationStatus
type: ParticipationStatus

privateClassification
type: AccessClassification

busyUnavailableFreebusyType
type: FreebusyType

chairRole
type: AttendeeRole

nonParticipantRole
type: AttendeeRole

freeFreebusyType
type: FreebusyType

yearly
type: RecurrenceFrequency

opaqueTransparency
type: TimeTransparency

inProcessStatus
type: TodoStatus

startTriggerRelation
type: TriggerRelation

unknownUserType
type: CalendarUserType

monday
type: Weekday

hourly
type: RecurrenceFrequency

thursday
type: Weekday

daily
type: RecurrenceFrequency

inProcessParticipationStatus
type: ParticipationStatus

weekly
type: RecurrenceFrequency

gregorianCalendarScale
type: CalendarScale

saturday
type: Weekday

tentativeStatus
type: EventStatus

minutely
type: RecurrenceFrequency

tuesday
type: Weekday

endTriggerRelation
type: TriggerRelation

friday
type: Weekday

thisAndPriorRange
type: RecurrenceIdentifierRange

draftStatus
type: JournalStatus

secondly
type: RecurrenceFrequency

tentativeParticipationStatus
type: ParticipationStatus

optParticipantRole
type: AttendeeRole

busyFreebusyType
type: FreebusyType

declinedParticipationStatus
type: ParticipationStatus

monthly
type: RecurrenceFrequency

roomUserType
type: CalendarUserType

publicClassification
type: AccessClassification

audioAction
type: AlarmAction

reqParticipantRole
type: AttendeeRole

confirmedStatus
type: EventStatus

confidentialClassification
type: AccessClassification

groupUserType
type: CalendarUserType

finalStatus
type: JournalStatus

thisAndFutureRange
type: RecurrenceIdentifierRange

transparentTransparency
type: TimeTransparency

cancelledJournalStatus
type: JournalStatus