party
type: Class
comment: Represents a single or a group of individuals
subclass of: Resource

symbol
type: Class
comment: Represents a symbol
subclass of: Resource

tag
type: Class
comment: Represents a generic tag
subclass of: Resource

annotation
type: Property
comment: Generic annotation for a resource
domain: Resource

alternative label
type: Property
comment: An alternative label alongside the preferred label for a resource
sub property of: label
range: Literal

freedesktopicon
type: Class
comment: Represents a desktop icon as defined in the FreeDesktop Icon Naming Standard
subclass of: symbol

iconname
type: Property
comment: Defines a name for a FreeDesktop Icon as defined in the FreeDesktop Icon Naming Standard
min cardinality: 1
sub property of: annotation
sub property of: identifier
domain: freedesktopicon
range: Literal

has Subresource
type: Property
comment: Defines a relationship between a resource and one or more sub resources
type: TransitiveProperty
range: Resource
sub property of: is related to
inverse property: has Superresource

has Superresource
type: Property
comment: Defines a relationship between a resource and one or more super resources
type: TransitiveProperty
range: Resource
sub property of: is related to
inverse property: has Subresource

score
type: Property
comment: An authorative score for an item valued between 0 and 1
sub property of: annotation
domain: Resource
range: float

scoreparameter
type: Property
comment: A marker property to mark selected properties which are input to a mathematical algorithm to generate scores for resources. Properties are marked by being defined as subproperties of this property
sub property of: annotation
domain: Resource
range: float

contributor
type: Property
comment: Refers to a single or a group of individuals that contributed to a resource
range: party
sub property of: annotation
sub property of: contributor
domain: Resource

creator
type: Property
comment: Refers to the single or group of individuals that created the resource
range: party
sub property of: annotation
sub property of: creator
domain: Resource

description
type: Property
comment: A non-technical textual annotation for a resource
sub property of: comment
sub property of: annotation
range: Literal

engineering tool
type: Property
comment: Specifies the engineering tool used to generate the graph
sub property of: annotation
domain: Data
range: Literal

has default namespace
type: Property
comment: Defines the default static namespace for a graph
sub property of: annotation
max cardinality: 1
domain: Data
range: Literal

has default namespace abbreviation
type: Property
comment: Defines the default static namespace abbreviation for a graph
sub property of: annotation
max cardinality: 1
domain: Data
range: Literal

rating
type: Property
comment: Annotation for a resource in the form of an unrestricted rating
sub property of: annotation
domain: Resource

numeric rating
type: Property
comment: Annotation for a resource in the form of a numeric rating (float value), allowed values are between 1 and 10 whereas 0 is interpreted as not set
sub property of: rating
sub property of: scoreparameter
domain: Resource
range: float
max cardinality: 1

has symbol
type: Property
comment: Annotation for a resource in the form of a symbol representation
range: symbol
domain: Resource

preferred symbol
type: Property
comment: A unique preferred symbol representation for a resource
sub property of: has symbol
range: symbol
domain: Resource

alternative symbol
type: Property
comment: An alternative symbol representation for a resource
range: symbol
sub property of: has symbol
domain: Resource

has tag
type: Property
comment: Defines an existing tag for a resource
range: tag
sub property of: annotation
inverse property: is tag for
domain: Resource

has topic
type: Property
comment: Defines a relationship between two resources, where the object is a topic of the subject
sub property of: is related to
inverse property: is topic of
range: Resource

identifier
type: Property
comment: Defines a generic identifier for a resource
domain: Resource

is related to
type: Property
comment: Defines an annotation for a resource in the form of a relationship between the subject resource and another resource
sub property of: annotation
type: SymmetricProperty
range: Resource

is tag for
type: Property
comment: States which resources a tag is associated with
domain: tag
sub property of: annotation
inverse property: has tag
range: Resource

is topic of
type: Property
comment: Defines a relationship between two resources, where the subject is a topic of the object
sub property of: is related to
inverse property: has topic
range: Resource

modified at
type: Property
comment: States the modification time for a resource
sub property of: annotation
sub property of: modified
domain: Resource
range: dateTime

created at
type: Property
comment: States the creation, or first modification time for a resource
sub property of: modified at
max cardinality: 1
domain: Resource
range: dateTime

lastModified
type: Property
comment: States the last modification time for a resource
sub property of: modified at
max cardinality: 1
domain: Resource
range: dateTime

personal identifier
type: Property
comment: Defines a personal string identifier for a resource
type: InverseFunctionalProperty
sub property of: identifier
range: Literal

preferred label
type: Property
comment: A preferred label for a resource
sub property of: label
range: Literal

preferred label plural form
type: Property
comment: The plural form of the preferred label for a resource
sub property of: label
range: Literal

serialization language
type: Property
comment: States the serialization language for a named graph that is represented within a document
max cardinality: 1
domain: DocumentGraph
range: Literal

status
type: Property
comment: Specifies the status of a graph, stable, unstable or testing
sub property of: annotation
max cardinality: 1
domain: Data
range: Literal

version
type: Property
comment: Specifies the version of a graph, in numeric format
sub property of: annotation
max cardinality: 1
domain: Data
range: float