test (self-hosted, Windows, hfenduleam)	Test — Phase B (heavy class, serialized, on a now-quiet box) — windows	﻿2026-08-28T12:54:36.4607331Z ##[group]Run .github/bench/wrap.ps1 -Step "test-phase-b" -Command "cargo nextest run --workspace --no-fail-fast -E '$env:HEAVY'"
test (self-hosted, Windows, hfenduleam)	Test — Phase B (heavy class, serialized, on a now-quiet box) — windows	2026-08-28T12:54:36.4607941Z .github/bench/wrap.ps1 -Step "test-phase-b" -Command "cargo nextest run --workspace --no-fail-fast -E '$env:HEAVY'"
test (self-hosted, Windows, hfenduleam)	Test — Phase B (heavy class, serialized, on a now-quiet box) — windows	2026-08-28T12:54:36.4613088Z shell: C:\Program Files\PowerShell\7\pwsh.EXE -command ". '{0}'"
test (self-hosted, Windows, hfenduleam)	Test — Phase B (heavy class, serialized, on a now-quiet box) — windows	2026-08-28T12:54:36.4613399Z env:
test (self-hosted, Windows, hfenduleam)	Test — Phase B (heavy class, serialized, on a now-quiet box) — windows	2026-08-28T12:54:36.4613511Z   CARGO_INCREMENTAL: 0
test (self-hosted, Windows, hfenduleam)	Test — Phase B (heavy class, serialized, on a now-quiet box) — windows	2026-08-28T12:54:36.4613652Z   SPT_TEST_EPHEMERAL_ADVISORY_PORTS: 1
test (self-hosted, Windows, hfenduleam)	Test — Phase B (heavy class, serialized, on a now-quiet box) — windows	2026-08-28T12:54:36.4613820Z   SPT_ATTACH_GATE_WATCHDOG_MS: 120000
test (self-hosted, Windows, hfenduleam)	Test — Phase B (heavy class, serialized, on a now-quiet box) — windows	2026-08-28T12:54:36.4613985Z   SPT_ATTACH_IPC_DEADLINE_MS: 30000
test (self-hosted, Windows, hfenduleam)	Test — Phase B (heavy class, serialized, on a now-quiet box) — windows	2026-08-28T12:54:36.4616752Z   HEAVY: (package(spt-daemon) & kind(test) & binary(/^(attach|brain_swap|broker|budget|conn_blackhole_lifecycle|controller_lease|daemon_e2e|daemon_lifecycle_real_brain|digest|dispatch|driven_by_selfheal|endpoint_lifecycle|endpoint_survival|exit_every_reap|handoff|idempotent|inject_control_wedge|input_ack_deadlock|mesh_recovery|net_worker_starve|redispatch|redispatch_stall|registry_lifecycle|render_lifecycle|resize_geometry_epoch|resize_presentation_barrier|restart_replay_lifetime|resume|shellchan|spawn_truth|transport_death_eof|two_origin_spanning|twohost)$/)) | (package(spt) & kind(test) & binary(/^(attach_wedge_e2e|bind_cwd_project_e2e|bind_honest_cross_perch_e2e|brain_respawn_rename|brain_split|brain_survive|daemon_refresh_e2e|dummy_harness_e2e|endpoint_teardown_authority_e2e|engine_room_bringup_e2e|er_brief_once_per_session_e2e|er_briefing_session_scoped_e2e|er_briefing_presentation_e2e|er_briefing_presented_e2e|er_sequestered_cwd_e2e|gateway_owner_shell_e2e|commune_two_cwd_e2e|job_escape_e2e|knock_approve_not_hostage_e2e|knock_mutual_cross_node_e2e|live_adapt_translation_swap_e2e|livehost_bootgate_e2e|multi_subnet_bringup_e2e|n1_pairing|oneliner_e2e|projindex_reader_e2e|projindex_writer_e2e|psyche_download_e2e|rc_attach_truth|resume_template_e2e|run_no_dup_session_e2e|wake_resume_bind_e2e)$/)) | (package(spt-term) & kind(test))
test (self-hosted, Windows, hfenduleam)	Test — Phase B (heavy class, serialized, on a now-quiet box) — windows	2026-08-28T12:54:36.4619780Z   SPT_CI_TEST_TMP: C:\actions-runner\_work\_temp\spt-test-tmp-33172022108-1-d12d5adc63dc4e078d13c47762a3448f
test (self-hosted, Windows, hfenduleam)	Test — Phase B (heavy class, serialized, on a now-quiet box) — windows	2026-08-28T12:54:36.4620351Z   TEMP: C:\actions-runner\_work\_temp\spt-test-tmp-33172022108-1-d12d5adc63dc4e078d13c47762a3448f
test (self-hosted, Windows, hfenduleam)	Test — Phase B (heavy class, serialized, on a now-quiet box) — windows	2026-08-28T12:54:36.4620710Z   TMP: C:\actions-runner\_work\_temp\spt-test-tmp-33172022108-1-d12d5adc63dc4e078d13c47762a3448f
test (self-hosted, Windows, hfenduleam)	Test — Phase B (heavy class, serialized, on a now-quiet box) — windows	2026-08-28T12:54:36.4620962Z ##[endgroup]
test (self-hosted, Windows, hfenduleam)	Test — Phase B (heavy class, serialized, on a now-quiet box) — windows	2026-08-28T12:54:54.3310602Z     Finished `test` profile [unoptimized + debuginfo] target(s) in 6.98s
test (self-hosted, Windows, hfenduleam)	Test — Phase B (heavy class, serialized, on a now-quiet box) — windows	2026-08-28T12:55:43.8738609Z ────────────
test (self-hosted, Windows, hfenduleam)	Test — Phase B (heavy class, serialized, on a now-quiet box) — windows	2026-08-28T12:55:43.8738945Z  Nextest run ID 02036189-362f-4697-9610-77c22dfd838d with nextest profile: default
test (self-hosted, Windows, hfenduleam)	Test — Phase B (heavy class, serialized, on a now-quiet box) — windows	2026-08-28T12:55:43.8739297Z     Starting 209 tests across 74 binaries (141 binaries skipped)
test (self-hosted, Windows, hfenduleam)	Test — Phase B (heavy class, serialized, on a now-quiet box) — windows	2026-08-28T12:55:52.2160437Z         PASS [   8.341s] (  1/209) spt::attach_wedge_e2e attach_wedge_dead_child_plus_dropped_pump_does_not_wedge_the_broker
test (self-hosted, Windows, hfenduleam)	Test — Phase B (heavy class, serialized, on a now-quiet box) — windows	2026-08-28T12:55:54.5567336Z         PASS [   2.341s] (  2/209) spt::bind_cwd_project_e2e endpoint_run_records_cwd_and_appears_under_its_project
test (self-hosted, Windows, hfenduleam)	Test — Phase B (heavy class, serialized, on a now-quiet box) — windows	2026-08-28T12:55:56.9478966Z         PASS [   2.391s] (  3/209) spt::bind_honest_cross_perch_e2e cross_perch_dead_owner_repin_is_refused_no_contamination
test (self-hosted, Windows, hfenduleam)	Test — Phase B (heavy class, serialized, on a now-quiet box) — windows	2026-08-28T12:56:11.9172748Z         PASS [  14.969s] (  4/209) spt::brain_respawn_rename brain_respawns_onto_applied_bytes_after_in_place_rename
test (self-hosted, Windows, hfenduleam)	Test — Phase B (heavy class, serialized, on a now-quiet box) — windows	2026-08-28T12:56:19.8363184Z         PASS [   7.919s] (  5/209) spt::brain_split broker_survives_brain_kill_and_respawns_it
test (self-hosted, Windows, hfenduleam)	Test — Phase B (heavy class, serialized, on a now-quiet box) — windows	2026-08-28T12:56:27.5805984Z         PASS [   7.744s] (  6/209) spt::brain_split seed_anchor_survives_brain_cycle
test (self-hosted, Windows, hfenduleam)	Test — Phase B (heavy class, serialized, on a now-quiet box) — windows	2026-08-28T12:56:37.2915130Z         PASS [   9.711s] (  7/209) spt::brain_survive pty_and_quic_survive_brain_process_restart_onto_swapped_binary
test (self-hosted, Windows, hfenduleam)	Test — Phase B (heavy class, serialized, on a now-quiet box) — windows	2026-08-28T12:56:39.2651217Z         PASS [   1.974s] (  8/209) spt::commune_two_cwd_e2e a_commune_written_from_a_worktree_is_loud_and_stale_while_the_registered_one_is_not
test (self-hosted, Windows, hfenduleam)	Test — Phase B (heavy class, serialized, on a now-quiet box) — windows	2026-08-28T12:56:43.7022333Z         PASS [   4.437s] (  9/209) spt::daemon_refresh_e2e daemon_refresh_cycles_brain_while_hosted_endpoint_survives
test (self-hosted, Windows, hfenduleam)	Test — Phase B (heavy class, serialized, on a now-quiet box) — windows	2026-08-28T12:56:51.3963422Z         PASS [   7.694s] ( 10/209) spt::dummy_harness_e2e endpoint_run_attach_awaits_online_before_attaching
test (self-hosted, Windows, hfenduleam)	Test — Phase B (heavy class, serialized, on a now-quiet box) — windows	2026-08-28T12:56:56.0071796Z         PASS [   4.611s] ( 11/209) spt::dummy_harness_e2e endpoint_run_brings_up_a_long_lived_dummy_harness_and_rc_attaches
test (self-hosted, Windows, hfenduleam)	Test — Phase B (heavy class, serialized, on a now-quiet box) — windows	2026-08-28T12:56:59.5032076Z         PASS [   3.496s] ( 12/209) spt::endpoint_teardown_authority_e2e shutdown_reaps_the_hosted_subtree_it_reports_suspending
test (self-hosted, Windows, hfenduleam)	Test — Phase B (heavy class, serialized, on a now-quiet box) — windows	2026-08-28T12:57:09.0626982Z         PASS [   9.558s] ( 13/209) spt::endpoint_teardown_authority_e2e stop_reaps_the_hosted_subtree_and_run_recovers_the_endpoint
test (self-hosted, Windows, hfenduleam)	Test — Phase B (heavy class, serialized, on a now-quiet box) — windows	2026-08-28T12:57:11.5070731Z         PASS [   2.445s] ( 14/209) spt::engine_room_bringup_e2e a_bringup_on_a_multi_subnet_node_leaves_the_room_a_perch
test (self-hosted, Windows, hfenduleam)	Test — Phase B (heavy class, serialized, on a now-quiet box) — windows	2026-08-28T12:57:48.9770325Z         PASS [  37.470s] ( 15/209) spt::engine_room_bringup_e2e a_bringup_whose_attach_never_arrived_leaves_no_grant_anywhere
test (self-hosted, Windows, hfenduleam)	Test — Phase B (heavy class, serialized, on a now-quiet box) — windows	2026-08-28T12:57:51.5778737Z         PASS [   2.601s] ( 16/209) spt::engine_room_bringup_e2e a_brought_up_engine_room_is_served_the_in_core_role_and_has_no_writer
test (self-hosted, Windows, hfenduleam)	Test — Phase B (heavy class, serialized, on a now-quiet box) — windows	2026-08-28T12:57:54.0263292Z         PASS [   2.448s] ( 17/209) spt::engine_room_bringup_e2e a_brought_up_engine_room_registers_no_relay_address_for_tcp_to_reach
test (self-hosted, Windows, hfenduleam)	Test — Phase B (heavy class, serialized, on a now-quiet box) — windows	2026-08-28T12:57:59.3986780Z         PASS [   5.372s] ( 18/209) spt::engine_room_bringup_e2e a_cleanly_offline_engine_room_is_still_brought_up_by_its_own_gate
test (self-hosted, Windows, hfenduleam)	Test — Phase B (heavy class, serialized, on a now-quiet box) — windows	2026-08-28T12:57:59.4080158Z         PASS [   0.009s] ( 19/209) spt::engine_room_bringup_e2e a_complete_ladder_with_no_expiry_is_green
test (self-hosted, Windows, hfenduleam)	Test — Phase B (heavy class, serialized, on a now-quiet box) — windows	2026-08-28T12:57:59.4178756Z         PASS [   0.010s] ( 20/209) spt::engine_room_bringup_e2e a_loud_launch_failure_is_candidate_a_from_either_witness
test (self-hosted, Windows, hfenduleam)	Test — Phase B (heavy class, serialized, on a now-quiet box) — windows	2026-08-28T12:57:59.4272963Z         PASS [   0.009s] ( 21/209) spt::engine_room_bringup_e2e a_pty_create_that_never_completed_is_candidate_c
test (self-hosted, Windows, hfenduleam)	Test — Phase B (heavy class, serialized, on a now-quiet box) — windows	2026-08-28T12:57:59.4371975Z         PASS [   0.010s] ( 22/209) spt::engine_room_bringup_e2e a_row_that_existed_and_then_did_not_is_candidate_d_not_late
test (self-hosted, Windows, hfenduleam)	Test — Phase B (heavy class, serialized, on a now-quiet box) — windows	2026-08-28T12:57:59.4456296Z         PASS [   0.008s] ( 23/209) spt::engine_room_bringup_e2e an_expiry_with_no_stamps_behind_it_is_unreadable_never_candidate_b
test (self-hosted, Windows, hfenduleam)	Test — Phase B (heavy class, serialized, on a now-quiet box) — windows	2026-08-28T12:58:01.8758604Z         PASS [   2.430s] ( 24/209) spt::engine_room_bringup_e2e er_bringup_from_the_operators_invocation_spawns_the_session
test (self-hosted, Windows, hfenduleam)	Test — Phase B (heavy class, serialized, on a now-quiet box) — windows	2026-08-28T12:58:04.2838458Z         PASS [   2.408s] ( 25/209) spt::engine_room_bringup_e2e er_bringup_launch_phases_reach_the_sink
test (self-hosted, Windows, hfenduleam)	Test — Phase B (heavy class, serialized, on a now-quiet box) — windows	2026-08-28T12:58:04.2956450Z         PASS [   0.012s] ( 26/209) spt::engine_room_bringup_e2e every_verdict_names_the_last_phase_each_side_reached
test (self-hosted, Windows, hfenduleam)	Test — Phase B (heavy class, serialized, on a now-quiet box) — windows	2026-08-28T12:58:10.4765239Z         PASS [   6.181s] ( 27/209) spt::er_brief_once_per_session_e2e a_second_seat_on_a_running_engine_room_is_not_re_briefed
test (self-hosted, Windows, hfenduleam)	Test — Phase B (heavy class, serialized, on a now-quiet box) — windows	2026-08-28T12:58:21.2829500Z         PASS [  10.806s] ( 28/209) spt::er_briefing_presentation_e2e er_briefing_presentation_measurements
test (self-hosted, Windows, hfenduleam)	Test — Phase B (heavy class, serialized, on a now-quiet box) — windows	2026-08-28T12:58:47.2805762Z         PASS [  25.998s] ( 29/209) spt::er_briefing_presented_e2e the_engine_room_briefing_is_presented_before_the_first_actionable_turn
test (self-hosted, Windows, hfenduleam)	Test — Phase B (heavy class, serialized, on a now-quiet box) — windows	2026-08-28T12:58:52.2333851Z         PASS [   4.953s] ( 30/209) spt::er_briefing_session_scoped_e2e a_new_session_never_delivers_an_older_sessions_briefing
test (self-hosted, Windows, hfenduleam)	Test — Phase B (heavy class, serialized, on a now-quiet box) — windows	2026-08-28T12:58:55.1423134Z         PASS [   2.909s] ( 31/209) spt::er_sequestered_cwd_e2e engine_room_launches_sequestered_and_nothing_is_written_into_it
test (self-hosted, Windows, hfenduleam)	Test — Phase B (heavy class, serialized, on a now-quiet box) — windows	2026-08-28T12:58:58.2616677Z         PASS [   3.119s] ( 32/209) spt::gateway_owner_shell_e2e gateway_typed_owner_owns_a_shell_on_every_path_keyed_on_id
test (self-hosted, Windows, hfenduleam)	Test — Phase B (heavy class, serialized, on a now-quiet box) — windows	2026-08-28T12:59:02.6240668Z         PASS [   4.362s] ( 33/209) spt::job_escape_e2e win::cold_start_daemon_escapes_kill_on_close_job_via_wmi
test (self-hosted, Windows, hfenduleam)	Test — Phase B (heavy class, serialized, on a now-quiet box) — windows	2026-08-28T12:59:05.7484885Z         PASS [   3.124s] ( 34/209) spt::job_escape_e2e win::wmi_daemon_run_has_no_conhost_window
test (self-hosted, Windows, hfenduleam)	Test — Phase B (heavy class, serialized, on a now-quiet box) — windows	2026-08-28T12:59:16.7313279Z         PASS [  10.983s] ( 35/209) spt::knock_approve_not_hostage_e2e an_approval_stands_and_exits_the_same_whether_or_not_its_wire_legs_arrive
test (self-hosted, Windows, hfenduleam)	Test — Phase B (heavy class, serialized, on a now-quiet box) — windows	2026-08-28T12:59:21.1171847Z         PASS [   4.386s] ( 36/209) spt::knock_mutual_cross_node_e2e a_cross_node_redemption_opens_the_presenters_own_side_and_only_asks_for_the_minters
test (self-hosted, Windows, hfenduleam)	Test — Phase B (heavy class, serialized, on a now-quiet box) — windows	2026-08-28T12:59:25.2023082Z         PASS [   4.085s] ( 37/209) spt::live_adapt_translation_swap_e2e adapter_apply_for_foreign_adapter_leaves_live_endpoint_untouched
test (self-hosted, Windows, hfenduleam)	Test — Phase B (heavy class, serialized, on a now-quiet box) — windows	2026-08-28T12:59:28.8644541Z         PASS [   3.662s] ( 38/209) spt::live_adapt_translation_swap_e2e adapter_apply_swaps_composite_profile_endpoint_matched_on_parent
test (self-hosted, Windows, hfenduleam)	Test — Phase B (heavy class, serialized, on a now-quiet box) — windows	2026-08-28T12:59:32.0609685Z         PASS [   3.196s] ( 39/209) spt::live_adapt_translation_swap_e2e adapter_apply_swaps_locked_translation_binary_without_restarting_endpoint
test (self-hosted, Windows, hfenduleam)	Test — Phase B (heavy class, serialized, on a now-quiet box) — windows	2026-08-28T12:59:34.0384280Z         PASS [   1.977s] ( 40/209) spt::live_adapt_translation_swap_e2e adapter_apply_with_no_matching_session_still_swaps
test (self-hosted, Windows, hfenduleam)	Test — Phase B (heavy class, serialized, on a now-quiet box) — windows	2026-08-28T12:59:44.1436646Z         PASS [  10.105s] ( 41/209) spt::livehost_bootgate_e2e cold_start_does_not_revive_a_sessionless_online_latched_perch
test (self-hosted, Windows, hfenduleam)	Test — Phase B (heavy class, serialized, on a now-quiet box) — windows	2026-08-28T12:59:47.4041128Z         PASS [   3.260s] ( 42/209) spt::multi_subnet_bringup_e2e fresh_unbound_is_attachable_before_bind
test (self-hosted, Windows, hfenduleam)	Test — Phase B (heavy class, serialized, on a now-quiet box) — windows	2026-08-28T12:59:49.9517377Z         PASS [   2.548s] ( 43/209) spt::multi_subnet_bringup_e2e multi_subnet_refuses_without_subnet_then_homes_and_binds
test (self-hosted, Windows, hfenduleam)	Test — Phase B (heavy class, serialized, on a now-quiet box) — windows	2026-08-28T12:59:52.3377581Z         PASS [   2.386s] ( 44/209) spt::multi_subnet_bringup_e2e single_subnet_control_auto_homes
test (self-hosted, Windows, hfenduleam)	Test — Phase B (heavy class, serialized, on a now-quiet box) — windows	2026-08-28T12:59:52.3609272Z         PASS [   0.023s] ( 45/209) spt::n1_pairing new_brain_serves_against_old_broker
test (self-hosted, Windows, hfenduleam)	Test — Phase B (heavy class, serialized, on a now-quiet box) — windows	2026-08-28T12:59:52.3904700Z         PASS [   0.029s] ( 46/209) spt::oneliner_e2e at_logon_task_launches_daemon_in_background_not_foreground
test (self-hosted, Windows, hfenduleam)	Test — Phase B (heavy class, serialized, on a now-quiet box) — windows	2026-08-28T12:59:52.3988746Z         PASS [   0.008s] ( 47/209) spt::oneliner_e2e install_script_against_staged_release
test (self-hosted, Windows, hfenduleam)	Test — Phase B (heavy class, serialized, on a now-quiet box) — windows	2026-08-28T12:59:52.4224948Z         PASS [   0.024s] ( 48/209) spt::projindex_reader_e2e daemon_failure_panel_reads_pre_redirect_capture_and_persistent_sink
test (self-hosted, Windows, hfenduleam)	Test — Phase B (heavy class, serialized, on a now-quiet box) — windows	2026-08-28T12:59:57.2131342Z         PASS [   4.791s] ( 49/209) spt::projindex_reader_e2e readers_answer_from_daemon_maintained_index_with_zero_git
test (self-hosted, Windows, hfenduleam)	Test — Phase B (heavy class, serialized, on a now-quiet box) — windows	2026-08-28T13:00:04.9394085Z         PASS [   7.726s] ( 50/209) spt::projindex_writer_e2e writer_cold_warm_and_event_invalidation_against_live_daemon
test (self-hosted, Windows, hfenduleam)	Test — Phase B (heavy class, serialized, on a now-quiet box) — windows	2026-08-28T13:00:08.2645821Z         PASS [   3.325s] ( 51/209) spt::psyche_download_e2e psyche_download_emits_brief_with_pending_then_self_clears
test (self-hosted, Windows, hfenduleam)	Test — Phase B (heavy class, serialized, on a now-quiet box) — windows	2026-08-28T13:00:10.3303314Z         PASS [   2.066s] ( 52/209) spt::rc_attach_truth harness_only_refuses_truthfully_pre_stream
test (self-hosted, Windows, hfenduleam)	Test — Phase B (heavy class, serialized, on a now-quiet box) — windows	2026-08-28T13:00:14.7194678Z         PASS [   4.389s] ( 53/209) spt::rc_attach_truth offline_row_over_live_session_attaches
test (self-hosted, Windows, hfenduleam)	Test — Phase B (heavy class, serialized, on a now-quiet box) — windows	2026-08-28T13:00:17.1375447Z         PASS [   2.415s] ( 54/209) spt::rc_attach_truth offline_row_with_no_session_refuses
test (self-hosted, Windows, hfenduleam)	Test — Phase B (heavy class, serialized, on a now-quiet box) — windows	2026-08-28T13:00:21.3226297Z         PASS [   4.188s] ( 55/209) spt::rc_attach_truth rc_owned_display_carries_no_pump_diagnostics
test (self-hosted, Windows, hfenduleam)	Test — Phase B (heavy class, serialized, on a now-quiet box) — windows	2026-08-28T13:00:29.0280367Z         PASS [   7.705s] ( 56/209) spt::rc_attach_truth resume_never_bound_reads_unbound_and_attaches
test (self-hosted, Windows, hfenduleam)	Test — Phase B (heavy class, serialized, on a now-quiet box) — windows	2026-08-28T13:00:35.4109915Z         PASS [   6.383s] ( 57/209) spt::rc_attach_truth zombie_claim_refuses_never_attaches
test (self-hosted, Windows, hfenduleam)	Test — Phase B (heavy class, serialized, on a now-quiet box) — windows	2026-08-28T13:00:42.6385315Z         PASS [   7.227s] ( 58/209) spt::resume_template_e2e endpoint_run_resume_selects_resume_template_in_recorded_cwd
test (self-hosted, Windows, hfenduleam)	Test — Phase B (heavy class, serialized, on a now-quiet box) — windows	2026-08-28T13:00:45.1895227Z         PASS [   2.551s] ( 59/209) spt::run_no_dup_session_e2e run_over_live_endpoint_never_mints_a_second_session
test (self-hosted, Windows, hfenduleam)	Test — Phase B (heavy class, serialized, on a now-quiet box) — windows	2026-08-28T13:01:12.8112741Z         PASS [  27.622s] ( 60/209) spt::wake_resume_bind_e2e wake_on_a_suspended_agent_resumes_binds_online_and_rehosts
test (self-hosted, Windows, hfenduleam)	Test — Phase B (heavy class, serialized, on a now-quiet box) — windows	2026-08-28T13:01:13.0467201Z         PASS [   0.235s] ( 61/209) spt-daemon::attach attach_registers_remote_drive_detection
test (self-hosted, Windows, hfenduleam)	Test — Phase B (heavy class, serialized, on a now-quiet box) — windows	2026-08-28T13:01:13.2228267Z         PASS [   0.176s] ( 62/209) spt-daemon::attach attach_survives_target_brain_restart_exactly_once
test (self-hosted, Windows, hfenduleam)	Test — Phase B (heavy class, serialized, on a now-quiet box) — windows	2026-08-28T13:01:13.2958190Z         PASS [   0.073s] ( 63/209) spt-daemon::attach broker_spawns_the_pty_child_in_the_requested_cwd
test (self-hosted, Windows, hfenduleam)	Test — Phase B (heavy class, serialized, on a now-quiet box) — windows	2026-08-28T13:01:13.3829812Z         PASS [   0.087s] ( 64/209) spt-daemon::attach controller_restart_with_viewer_no_displace_and_viewer_survives
test (self-hosted, Windows, hfenduleam)	Test — Phase B (heavy class, serialized, on a now-quiet box) — windows	2026-08-28T13:01:13.4720750Z         PASS [   0.089s] ( 65/209) spt-daemon::attach controller_viewer_matrix_and_loud_take
test (self-hosted, Windows, hfenduleam)	Test — Phase B (heavy class, serialized, on a now-quiet box) — windows	2026-08-28T13:01:13.5100341Z         PASS [   0.038s] ( 66/209) spt-daemon::attach handoff_seeds_resume_cursor_and_resubscribes_for_resume
test (self-hosted, Windows, hfenduleam)	Test — Phase B (heavy class, serialized, on a now-quiet box) — windows	2026-08-28T13:01:13.6045205Z         PASS [   0.094s] ( 67/209) spt-daemon::attach local_attach_via_loopback_conn_rides_the_same_pump
test (self-hosted, Windows, hfenduleam)	Test — Phase B (heavy class, serialized, on a now-quiet box) — windows	2026-08-28T13:01:14.7223986Z         PASS [   1.118s] ( 68/209) spt-daemon::attach loopback_attach_to_a_prepopulated_ring_delivers_without_deadlock
test (self-hosted, Windows, hfenduleam)	Test — Phase B (heavy class, serialized, on a now-quiet box) — windows	2026-08-28T13:01:14.8043929Z         PASS [   0.082s] ( 69/209) spt-daemon::attach loopback_self_dial_is_refused_local_uses_fallback_transport
test (self-hosted, Windows, hfenduleam)	Test — Phase B (heavy class, serialized, on a now-quiet box) — windows	2026-08-28T13:01:14.8463357Z         PASS [   0.042s] ( 70/209) spt-daemon::attach re_serve_resets_resume_cursor_after_a_pre_attached_consume
test (self-hosted, Windows, hfenduleam)	Test — Phase B (heavy class, serialized, on a now-quiet box) — windows	2026-08-28T13:01:15.6812469Z         PASS [   0.835s] ( 71/209) spt-daemon::attach remote_attach_drives_a_real_pty_cross_daemon
test (self-hosted, Windows, hfenduleam)	Test — Phase B (heavy class, serialized, on a now-quiet box) — windows	2026-08-28T13:01:15.7843364Z         PASS [   0.103s] ( 72/209) spt-daemon::attach resize_is_controller_exclusive
test (self-hosted, Windows, hfenduleam)	Test — Phase B (heavy class, serialized, on a now-quiet box) — windows	2026-08-28T13:01:15.8802207Z         PASS [   0.096s] ( 73/209) spt-daemon::attach same_origin_re_subscribe_does_not_displace
test (self-hosted, Windows, hfenduleam)	Test — Phase B (heavy class, serialized, on a now-quiet box) — windows	2026-08-28T13:01:16.0306141Z         PASS [   0.150s] ( 74/209) spt-daemon::attach spt_hosted_bringup_then_cross_node_attach_drives_the_pty
test (self-hosted, Windows, hfenduleam)	Test — Phase B (heavy class, serialized, on a now-quiet box) — windows	2026-08-28T13:01:16.4203690Z         PASS [   0.390s] ( 75/209) spt-daemon::attach wedged_viewer_does_not_stall_controller
test (self-hosted, Windows, hfenduleam)	Test — Phase B (heavy class, serialized, on a now-quiet box) — windows	2026-08-28T13:01:17.5841391Z         PASS [   1.164s] ( 76/209) spt-daemon::brain_swap brain_only_update_swaps_logic_with_zero_endpoint_interruption
test (self-hosted, Windows, hfenduleam)	Test — Phase B (heavy class, serialized, on a now-quiet box) — windows	2026-08-28T13:01:18.4308597Z         PASS [   0.847s] ( 77/209) spt-daemon::broker ack_false_input_suppresses_applied_frame
test (self-hosted, Windows, hfenduleam)	Test — Phase B (heavy class, serialized, on a now-quiet box) — windows	2026-08-28T13:01:19.5642722Z         PASS [   1.133s] ( 78/209) spt-daemon::broker broker_hosts_pty_child_streams_output_and_accepts_input
test (self-hosted, Windows, hfenduleam)	Test — Phase B (heavy class, serialized, on a now-quiet box) — windows	2026-08-28T13:01:20.7648889Z         PASS [   1.201s] ( 79/209) spt-daemon::broker controller_writer_reorder_consumer_view_stays_monotonic_and_session_live
test (self-hosted, Windows, hfenduleam)	Test — Phase B (heavy class, serialized, on a now-quiet box) — windows	2026-08-28T13:01:21.8969940Z         PASS [   1.132s] ( 80/209) spt-daemon::broker dead_session_subscribe_does_not_hang
test (self-hosted, Windows, hfenduleam)	Test — Phase B (heavy class, serialized, on a now-quiet box) — windows	2026-08-28T13:01:22.7731686Z         PASS [   0.876s] ( 81/209) spt-daemon::broker endpoint_keyed_inject_without_binary_spools_not_pty
test (self-hosted, Windows, hfenduleam)	Test — Phase B (heavy class, serialized, on a now-quiet box) — windows	2026-08-28T13:01:22.9211763Z         PASS [   0.148s] ( 82/209) spt-daemon::broker exactly_once_preserved_on_no_ack_path
test (self-hosted, Windows, hfenduleam)	Test — Phase B (heavy class, serialized, on a now-quiet box) — windows	2026-08-28T13:01:23.8264832Z         PASS [   0.905s] ( 83/209) spt-daemon::broker spawn_env_reaches_child
test (self-hosted, Windows, hfenduleam)	Test — Phase B (heavy class, serialized, on a now-quiet box) — windows	2026-08-28T13:01:24.6660218Z         PASS [   0.839s] ( 84/209) spt-daemon::broker wall_b_endpoint_run_env_then_send_spools
test (self-hosted, Windows, hfenduleam)	Test — Phase B (heavy class, serialized, on a now-quiet box) — windows	2026-08-28T13:01:24.6787109Z         PASS [   0.013s] ( 85/209) spt-daemon::budget measure_dormant_seat_budget
test (self-hosted, Windows, hfenduleam)	Test — Phase B (heavy class, serialized, on a now-quiet box) — windows	2026-08-28T13:01:25.7949251Z         PASS [   1.116s] ( 86/209) spt-daemon::conn_blackhole_lifecycle blackholed_controller_lifecycle_five_invariants
test (self-hosted, Windows, hfenduleam)	Test — Phase B (heavy class, serialized, on a now-quiet box) — windows	2026-08-28T13:01:27.8982675Z         PASS [   2.103s] ( 87/209) spt-daemon::controller_lease equal_lease_replay_stays_silent_and_never_self_displaces
test (self-hosted, Windows, hfenduleam)	Test — Phase B (heavy class, serialized, on a now-quiet box) — windows	2026-08-28T13:01:29.5078128Z         PASS [   1.609s] ( 88/209) spt-daemon::controller_lease revoke_terminates_a_wedged_incumbent_plain_control
test (self-hosted, Windows, hfenduleam)	Test — Phase B (heavy class, serialized, on a now-quiet box) — windows	2026-08-28T13:01:31.0959193Z         PASS [   1.588s] ( 89/209) spt-daemon::controller_lease revoke_terminates_a_wedged_incumbent_take
test (self-hosted, Windows, hfenduleam)	Test — Phase B (heavy class, serialized, on a now-quiet box) — windows	2026-08-28T13:01:31.5057436Z         PASS [   0.410s] ( 90/209) spt-daemon::controller_lease same_node_distinct_lease_take_displaces_loudly_and_completes_the_stream
test (self-hosted, Windows, hfenduleam)	Test — Phase B (heavy class, serialized, on a now-quiet box) — windows	2026-08-28T13:01:31.8957176Z         PASS [   0.390s] ( 91/209) spt-daemon::controller_lease same_node_newer_gen_plain_control_supersedes_loudly_and_completes_the_stream
test (self-hosted, Windows, hfenduleam)	Test — Phase B (heavy class, serialized, on a now-quiet box) — windows	2026-08-28T13:01:32.0019173Z         PASS [   0.106s] ( 92/209) spt-daemon::controller_lease stale_lease_input_and_resize_mutate_nothing_and_shell_injection_lands
test (self-hosted, Windows, hfenduleam)	Test — Phase B (heavy class, serialized, on a now-quiet box) — windows	2026-08-28T13:01:34.9448985Z         PASS [   2.943s] ( 93/209) spt-daemon::daemon_e2e daemon_hosts_lifecycle_and_survives_brain_restart
test (self-hosted, Windows, hfenduleam)	Test — Phase B (heavy class, serialized, on a now-quiet box) — windows	2026-08-28T13:01:37.2425727Z         PASS [   2.298s] ( 94/209) spt-daemon::daemon_lifecycle_real_brain real_brain_process_hosts_the_psyche_for_an_online_live_endpoint
test (self-hosted, Windows, hfenduleam)	Test — Phase B (heavy class, serialized, on a now-quiet box) — windows	2026-08-28T13:01:37.5248669Z         PASS [   0.282s] ( 95/209) spt-daemon::digest harness_hosted_digest_projects_and_pushes_deltas
test (self-hosted, Windows, hfenduleam)	Test — Phase B (heavy class, serialized, on a now-quiet box) — windows	2026-08-28T13:01:37.5408614Z         PASS [   0.016s] ( 96/209) spt-daemon::dispatch classify_routes_a_node_label_feed_to_registry
test (self-hosted, Windows, hfenduleam)	Test — Phase B (heavy class, serialized, on a now-quiet box) — windows	2026-08-28T13:01:37.7702230Z         PASS [   0.229s] ( 97/209) spt-daemon::dispatch dispatcher_applies_a_notif_feed_undriven
test (self-hosted, Windows, hfenduleam)	Test — Phase B (heavy class, serialized, on a now-quiet box) — windows	2026-08-28T13:01:38.0250925Z         PASS [   0.255s] ( 98/209) spt-daemon::dispatch dispatcher_funnels_wan_messages_undriven
test (self-hosted, Windows, hfenduleam)	Test — Phase B (heavy class, serialized, on a now-quiet box) — windows	2026-08-28T13:01:38.2026888Z         PASS [   0.178s] ( 99/209) spt-daemon::dispatch dispatcher_resolves_attach_by_endpoint_and_refuses_a_stale_endpoint
test (self-hosted, Windows, hfenduleam)	Test — Phase B (heavy class, serialized, on a now-quiet box) — windows	2026-08-28T13:01:38.5440863Z         PASS [   0.341s] (100/209) spt-daemon::dispatch dispatcher_serves_a_cross_node_shell_link
test (self-hosted, Windows, hfenduleam)	Test — Phase B (heavy class, serialized, on a now-quiet box) — windows	2026-08-28T13:01:38.6881711Z         PASS [   0.144s] (101/209) spt-daemon::dispatch dispatcher_serves_a_file_fetch_undriven
test (self-hosted, Windows, hfenduleam)	Test — Phase B (heavy class, serialized, on a now-quiet box) — windows	2026-08-28T13:01:38.9025175Z         PASS [   0.214s] (102/209) spt-daemon::dispatch dispatcher_serves_a_remote_drive_attach_undriven
test (self-hosted, Windows, hfenduleam)	Test — Phase B (heavy class, serialized, on a now-quiet box) — windows	2026-08-28T13:01:39.1139315Z         PASS [   0.211s] (103/209) spt-daemon::dispatch dispatcher_serves_a_subnet_serve_probe
test (self-hosted, Windows, hfenduleam)	Test — Phase B (heavy class, serialized, on a now-quiet box) — windows	2026-08-28T13:01:41.3776103Z         PASS [   2.264s] (104/209) spt-daemon::dispatch dispatcher_serves_a_sync_pull_undriven
test (self-hosted, Windows, hfenduleam)	Test — Phase B (heavy class, serialized, on a now-quiet box) — windows	2026-08-28T13:01:41.6178196Z         PASS [   0.240s] (105/209) spt-daemon::dispatch dispatcher_serves_an_update_pull_undriven
test (self-hosted, Windows, hfenduleam)	Test — Phase B (heavy class, serialized, on a now-quiet box) — windows	2026-08-28T13:01:41.9725878Z         PASS [   0.355s] (106/209) spt-daemon::dispatch dispatcher_surfaces_a_remote_won_notif_at_the_winning_node
test (self-hosted, Windows, hfenduleam)	Test — Phase B (heavy class, serialized, on a now-quiet box) — windows	2026-08-28T13:01:42.1863669Z         PASS [   0.214s] (107/209) spt-daemon::dispatch dispatcher_survives_an_unknown_stream
test (self-hosted, Windows, hfenduleam)	Test — Phase B (heavy class, serialized, on a now-quiet box) — windows	2026-08-28T13:01:42.7399094Z         PASS [   0.553s] (108/209) spt-daemon::driven_by_selfheal gap_a_live_session_controller_by_is_ambiguous_so_reconcile_must_not_clear
test (self-hosted, Windows, hfenduleam)	Test — Phase B (heavy class, serialized, on a now-quiet box) — windows	2026-08-28T13:01:42.8991737Z         PASS [   0.159s] (109/209) spt-daemon::driven_by_selfheal gap_b_sessionless_perch_reconcile_offlines_and_clears_driven_by
test (self-hosted, Windows, hfenduleam)	Test — Phase B (heavy class, serialized, on a now-quiet box) — windows	2026-08-28T13:01:43.0726815Z         PASS [   0.173s] (110/209) spt-daemon::endpoint_lifecycle an_inherited_stamp_from_a_dead_relay_converges_while_a_dead_binder_row_stays_online
test (self-hosted, Windows, hfenduleam)	Test — Phase B (heavy class, serialized, on a now-quiet box) — windows	2026-08-28T13:01:43.1852493Z         PASS [   0.113s] (111/209) spt-daemon::endpoint_lifecycle dead_pid_hybrid_row_does_not_survive_reconcile
test (self-hosted, Windows, hfenduleam)	Test — Phase B (heavy class, serialized, on a now-quiet box) — windows	2026-08-28T13:01:43.6212144Z         PASS [   0.436s] (112/209) spt-daemon::endpoint_lifecycle dead_relay_converges_while_its_live_sibling_still_delivers
test (self-hosted, Windows, hfenduleam)	Test — Phase B (heavy class, serialized, on a now-quiet box) — windows	2026-08-28T13:01:43.7929062Z         PASS [   0.172s] (113/209) spt-daemon::endpoint_lifecycle definitive_death_normalizes_and_next_reconcile_emits_no_wake_resume
test (self-hosted, Windows, hfenduleam)	Test — Phase B (heavy class, serialized, on a now-quiet box) — windows	2026-08-28T13:01:44.9141525Z         PASS [   1.121s] (114/209) spt-daemon::endpoint_lifecycle poll_vs_reap_interleave_converges_to_cleared_stamps
test (self-hosted, Windows, hfenduleam)	Test — Phase B (heavy class, serialized, on a now-quiet box) — windows	2026-08-28T13:01:45.1761299Z         PASS [   0.262s] (115/209) spt-daemon::endpoint_lifecycle raw_viewport_close_frees_the_controller_full_chain_across_broker_restart
test (self-hosted, Windows, hfenduleam)	Test — Phase B (heavy class, serialized, on a now-quiet box) — windows	2026-08-28T13:01:45.4925166Z         PASS [   0.316s] (116/209) spt-daemon::endpoint_survival daemon_restart_reruns_a_previously_online_orphaned_endpoint
test (self-hosted, Windows, hfenduleam)	Test — Phase B (heavy class, serialized, on a now-quiet box) — windows	2026-08-28T13:01:45.7763667Z         PASS [   0.284s] (117/209) spt-daemon::endpoint_survival daemon_restart_resumes_a_ready_agent_controllable_orphan
test (self-hosted, Windows, hfenduleam)	Test — Phase B (heavy class, serialized, on a now-quiet box) — windows	2026-08-28T13:01:45.8198313Z         PASS [   0.043s] (118/209) spt-daemon::endpoint_survival reconcile_leaves_a_legitimate_live_pid_ready_listener_online
test (self-hosted, Windows, hfenduleam)	Test — Phase B (heavy class, serialized, on a now-quiet box) — windows	2026-08-28T13:01:45.9183235Z         PASS [   0.098s] (119/209) spt-daemon::endpoint_survival reconcile_terminally_offlines_a_sessionless_ready_agent_controllable_hybrid
test (self-hosted, Windows, hfenduleam)	Test — Phase B (heavy class, serialized, on a now-quiet box) — windows	2026-08-28T13:01:47.3573005Z         PASS [   1.439s] (120/209) spt-daemon::exit_every_reap every_completed_reap_reaches_the_attached_terminal_as_an_exit
test (self-hosted, Windows, hfenduleam)	Test — Phase B (heavy class, serialized, on a now-quiet box) — windows	2026-08-28T13:01:48.7151717Z         PASS [   1.358s] (121/209) spt-daemon::handoff brain_restart_survives_gaplessly_with_fresh_gen_start
test (self-hosted, Windows, hfenduleam)	Test — Phase B (heavy class, serialized, on a now-quiet box) — windows	2026-08-28T13:01:48.7794602Z         PASS [   0.064s] (122/209) spt-daemon::idempotent pty_writes_are_exactly_once_across_brain_crashes
test (self-hosted, Windows, hfenduleam)	Test — Phase B (heavy class, serialized, on a now-quiet box) — windows	2026-08-28T13:01:52.8307720Z         PASS [   4.051s] (123/209) spt-daemon::inject_control_wedge a_backed_up_controller_does_not_wedge_the_session
test (self-hosted, Windows, hfenduleam)	Test — Phase B (heavy class, serialized, on a now-quiet box) — windows	2026-08-28T13:01:55.8311946Z         PASS [   3.000s] (124/209) spt-daemon::inject_control_wedge a_journaled_input_wedge_does_not_starve_a_concurrent_rc_attach
test (self-hosted, Windows, hfenduleam)	Test — Phase B (heavy class, serialized, on a now-quiet box) — windows	2026-08-28T13:01:57.6939931Z         PASS [   1.863s] (125/209) spt-daemon::inject_control_wedge c1_miss_once_preserves_binary_and_next_inject_delivers
test (self-hosted, Windows, hfenduleam)	Test — Phase B (heavy class, serialized, on a now-quiet box) — windows	2026-08-28T13:01:59.7700627Z         PASS [   2.076s] (126/209) spt-daemon::inject_control_wedge c1_strike_fault_stamps_perch_and_bounded_respawns_then_gives_up
test (self-hosted, Windows, hfenduleam)	Test — Phase B (heavy class, serialized, on a now-quiet box) — windows	2026-08-28T13:02:12.1891381Z         PASS [  12.419s] (127/209) spt-daemon::inject_control_wedge g1_choreography_happy_path_payload_reaches_pty_and_controller_keeps_control
test (self-hosted, Windows, hfenduleam)	Test — Phase B (heavy class, serialized, on a now-quiet box) — windows	2026-08-28T13:02:14.1142482Z         PASS [   1.925s] (128/209) spt-daemon::inject_control_wedge g2_no_commit_deadline_faults_binary_and_does_not_wedge_controller_input
test (self-hosted, Windows, hfenduleam)	Test — Phase B (heavy class, serialized, on a now-quiet box) — windows	2026-08-28T13:02:14.8931184Z         PASS [   0.779s] (129/209) spt-daemon::inject_control_wedge g3_content_free_ping_never_duplicates_operator_keystrokes_into_binary
test (self-hosted, Windows, hfenduleam)	Test — Phase B (heavy class, serialized, on a now-quiet box) — windows	2026-08-28T13:02:15.7497138Z         PASS [   0.857s] (130/209) spt-daemon::inject_control_wedge g4_translation_child_is_reaped_no_zombie_after_session_down
test (self-hosted, Windows, hfenduleam)	Test — Phase B (heavy class, serialized, on a now-quiet box) — windows	2026-08-28T13:02:17.9871061Z         PASS [   2.237s] (131/209) spt-daemon::inject_control_wedge g5_active_endpoint_spools_deferred_and_is_not_injected
test (self-hosted, Windows, hfenduleam)	Test — Phase B (heavy class, serialized, on a now-quiet box) — windows	2026-08-28T13:02:20.0312355Z         PASS [   2.044s] (132/209) spt-daemon::inject_control_wedge g6_faulted_inflight_envelope_is_respooled_not_lost
test (self-hosted, Windows, hfenduleam)	Test — Phase B (heavy class, serialized, on a now-quiet box) — windows	2026-08-28T13:02:32.3447449Z         PASS [  12.313s] (133/209) spt-daemon::inject_control_wedge g7_native_injects_mid_active_bypassing_the_idle_gate
test (self-hosted, Windows, hfenduleam)	Test — Phase B (heavy class, serialized, on a now-quiet box) — windows	2026-08-28T13:02:33.5904519Z         PASS [   1.246s] (134/209) spt-daemon::inject_control_wedge large_endpoint_inject_to_a_no_binary_session_spools_promptly_without_wedging
test (self-hosted, Windows, hfenduleam)	Test — Phase B (heavy class, serialized, on a now-quiet box) — windows	2026-08-28T13:02:43.7643198Z         PASS [  10.174s] (135/209) spt-daemon::inject_control_wedge p0_paste_wedge_parked_write_does_not_starve_attach_or_wedge_broker
test (self-hosted, Windows, hfenduleam)	Test — Phase B (heavy class, serialized, on a now-quiet box) — windows	2026-08-28T13:02:44.2216454Z         PASS [   0.457s] (136/209) spt-daemon::inject_control_wedge parked_message_to_already_idle_endpoint_is_delivered_without_a_poke
test (self-hosted, Windows, hfenduleam)	Test — Phase B (heavy class, serialized, on a now-quiet box) — windows	2026-08-28T13:02:44.7566521Z         PASS [   0.535s] (137/209) spt-daemon::inject_control_wedge w5_a1_locally_driven_session_reports_controller_by_none
test (self-hosted, Windows, hfenduleam)	Test — Phase B (heavy class, serialized, on a now-quiet box) — windows	2026-08-28T13:02:49.9201460Z         PASS [   5.163s] (138/209) spt-daemon::inject_control_wedge w5_a2_abandoned_remote_controller_conn_close_eviction_is_platform_divergent
test (self-hosted, Windows, hfenduleam)	Test — Phase B (heavy class, serialized, on a now-quiet box) — windows	2026-08-28T13:02:50.2089543Z         PASS [   0.289s] (139/209) spt-daemon::inject_control_wedge w5a_bigmultiline_inject_arrives_byte_complete_across_a_loop
test (self-hosted, Windows, hfenduleam)	Test — Phase B (heavy class, serialized, on a now-quiet box) — windows	2026-08-28T13:02:53.6021742Z         PASS [   3.393s] (140/209) spt-daemon::inject_control_wedge w5a_forced_echo_miss_redrives_once_then_loud_spools
test (self-hosted, Windows, hfenduleam)	Test — Phase B (heavy class, serialized, on a now-quiet box) — windows	2026-08-28T13:03:07.4015710Z         PASS [  13.799s] (141/209) spt-daemon::inject_control_wedge wan_arrival_to_idle_spt_hosted_injects_with_no_hook_poll
test (self-hosted, Windows, hfenduleam)	Test — Phase B (heavy class, serialized, on a now-quiet box) — windows	2026-08-28T13:03:11.7843574Z         FAIL [   4.380s] (142/209) spt-daemon::input_ack_deadlock input_flood_through_serve_attach_does_not_deadlock_broker
test (self-hosted, Windows, hfenduleam)	Test — Phase B (heavy class, serialized, on a now-quiet box) — windows	2026-08-28T13:03:11.7844645Z   stdout ───
test (self-hosted, Windows, hfenduleam)	Test — Phase B (heavy class, serialized, on a now-quiet box) — windows	2026-08-28T13:03:11.7844811Z 
test (self-hosted, Windows, hfenduleam)	Test — Phase B (heavy class, serialized, on a now-quiet box) — windows	2026-08-28T13:03:11.7844919Z     running 1 test
test (self-hosted, Windows, hfenduleam)	Test — Phase B (heavy class, serialized, on a now-quiet box) — windows	2026-08-28T13:03:11.7845521Z     test input_flood_through_serve_attach_does_not_deadlock_broker ... FAILED
test (self-hosted, Windows, hfenduleam)	Test — Phase B (heavy class, serialized, on a now-quiet box) — windows	2026-08-28T13:03:11.7845873Z 
test (self-hosted, Windows, hfenduleam)	Test — Phase B (heavy class, serialized, on a now-quiet box) — windows	2026-08-28T13:03:11.7845942Z     failures:
test (self-hosted, Windows, hfenduleam)	Test — Phase B (heavy class, serialized, on a now-quiet box) — windows	2026-08-28T13:03:11.7846068Z 
test (self-hosted, Windows, hfenduleam)	Test — Phase B (heavy class, serialized, on a now-quiet box) — windows	2026-08-28T13:03:11.7855413Z     failures:
test (self-hosted, Windows, hfenduleam)	Test — Phase B (heavy class, serialized, on a now-quiet box) — windows	2026-08-28T13:03:11.7855717Z         input_flood_through_serve_attach_does_not_deadlock_broker
test (self-hosted, Windows, hfenduleam)	Test — Phase B (heavy class, serialized, on a now-quiet box) — windows	2026-08-28T13:03:11.7855962Z 
test (self-hosted, Windows, hfenduleam)	Test — Phase B (heavy class, serialized, on a now-quiet box) — windows	2026-08-28T13:03:11.7856226Z     test result: FAILED. 0 passed; 1 failed; 0 ignored; 0 measured; 0 filtered out; finished in 4.34s
test (self-hosted, Windows, hfenduleam)	Test — Phase B (heavy class, serialized, on a now-quiet box) — windows	2026-08-28T13:03:11.7856590Z 
test (self-hosted, Windows, hfenduleam)	Test — Phase B (heavy class, serialized, on a now-quiet box) — windows	2026-08-28T13:03:11.7856739Z   stderr ───
test (self-hosted, Windows, hfenduleam)	Test — Phase B (heavy class, serialized, on a now-quiet box) — windows	2026-08-28T13:03:11.7857153Z     NTP_TOTP_UNCORRECTED: all NTP servers unreachable — ceremony clock = raw system clock
test (self-hosted, Windows, hfenduleam)	Test — Phase B (heavy class, serialized, on a now-quiet box) — windows	2026-08-28T13:03:11.7857645Z     SPAWN_PHASE:ack-deadlock-ep phase=received t_ms=0 fresh=false
test (self-hosted, Windows, hfenduleam)	Test — Phase B (heavy class, serialized, on a now-quiet box) — windows	2026-08-28T13:03:11.7858677Z     SPAWN_PHASE:ack-deadlock-ep phase=gate_claimed t_ms=0
test (self-hosted, Windows, hfenduleam)	Test — Phase B (heavy class, serialized, on a now-quiet box) — windows	2026-08-28T13:03:11.7859097Z     SPAWN_PHASE:ack-deadlock-ep phase=pty_creating t_ms=0 program=powershell
test (self-hosted, Windows, hfenduleam)	Test — Phase B (heavy class, serialized, on a now-quiet box) — windows	2026-08-28T13:03:11.7859582Z     SPAWN_PHASE:ack-deadlock-ep phase=pty_created t_ms=269 pid=Some(44088)
test (self-hosted, Windows, hfenduleam)	Test — Phase B (heavy class, serialized, on a now-quiet box) — windows	2026-08-28T13:03:11.7859999Z     SPAWN_PHASE:ack-deadlock-ep phase=input_writer t_ms=269
test (self-hosted, Windows, hfenduleam)	Test — Phase B (heavy class, serialized, on a now-quiet box) — windows	2026-08-28T13:03:11.7860887Z     CONN_LIFECYCLE: conn=1 role=brain controller session=1 endpoint=ack-deadlock-ep by=local wall_ms=1787922187798 mono_ms=0 event=controller-attach session=1 from_seq=0 [REQ-CONN-POISON-ATTRIBUTION]
test (self-hosted, Windows, hfenduleam)	Test — Phase B (heavy class, serialized, on a now-quiet box) — windows	2026-08-28T13:03:11.7861741Z     SPAWN_PHASE:ack-deadlock-ep phase=log_ready t_ms=270
test (self-hosted, Windows, hfenduleam)	Test — Phase B (heavy class, serialized, on a now-quiet box) — windows	2026-08-28T13:03:11.7862090Z     SPAWN_PHASE:ack-deadlock-ep phase=drain_armed t_ms=270
test (self-hosted, Windows, hfenduleam)	Test — Phase B (heavy class, serialized, on a now-quiet box) — windows	2026-08-28T13:03:11.7862455Z     SPAWN_PHASE:ack-deadlock-ep phase=waiter_armed t_ms=270
test (self-hosted, Windows, hfenduleam)	Test — Phase B (heavy class, serialized, on a now-quiet box) — windows	2026-08-28T13:03:11.7862828Z     SPAWN_PHASE:ack-deadlock-ep phase=translation_ready t_ms=270
test (self-hosted, Windows, hfenduleam)	Test — Phase B (heavy class, serialized, on a now-quiet box) — windows	2026-08-28T13:03:11.7863248Z     SPAWN_PHASE:ack-deadlock-ep phase=row_inserted t_ms=270 session=1
test (self-hosted, Windows, hfenduleam)	Test — Phase B (heavy class, serialized, on a now-quiet box) — windows	2026-08-28T13:03:11.7864034Z     CONN_LIFECYCLE: conn=1 role=brain controller session=1 endpoint=ack-deadlock-ep by=local wall_ms=1787922187799 mono_ms=0 event=write-start [REQ-CONN-POISON-ATTRIBUTION]
test (self-hosted, Windows, hfenduleam)	Test — Phase B (heavy class, serialized, on a now-quiet box) — windows	2026-08-28T13:03:11.7864735Z     PUMP_IPC_READER: spawned
test (self-hosted, Windows, hfenduleam)	Test — Phase B (heavy class, serialized, on a now-quiet box) — windows	2026-08-28T13:03:11.7865196Z     CONN_LIFECYCLE: conn=2 role=brain wall_ms=1787922187810 mono_ms=11 event=write-start [REQ-CONN-POISON-ATTRIBUTION]
test (self-hosted, Windows, hfenduleam)	Test — Phase B (heavy class, serialized, on a now-quiet box) — windows	2026-08-28T13:03:11.7865702Z     PUMP_IPC_READER: exited
test (self-hosted, Windows, hfenduleam)	Test — Phase B (heavy class, serialized, on a now-quiet box) — windows	2026-08-28T13:03:11.7866090Z     STREAM_CONNBOUND_RETIRE:2: opener conn exited — FIN + terminal retire
test (self-hosted, Windows, hfenduleam)	Test — Phase B (heavy class, serialized, on a now-quiet box) — windows	2026-08-28T13:03:11.7866829Z     CONN_LIFECYCLE: conn=2 role=brain wall_ms=1787922189967 mono_ms=2169 event=transport-close poisoned=false timed_out=false [REQ-CONN-POISON-ATTRIBUTION]
test (self-hosted, Windows, hfenduleam)	Test — Phase B (heavy class, serialized, on a now-quiet box) — windows	2026-08-28T13:03:11.7867706Z     CONN_LIFECYCLE: conn=3 role=brain wall_ms=1787922190825 mono_ms=3027 event=write-start [REQ-CONN-POISON-ATTRIBUTION]
test (self-hosted, Windows, hfenduleam)	Test — Phase B (heavy class, serialized, on a now-quiet box) — windows	2026-08-28T13:03:11.7868576Z     CONN_LIFECYCLE: conn=3 role=brain wall_ms=1787922190826 mono_ms=3027 event=transport-close poisoned=false timed_out=false [REQ-CONN-POISON-ATTRIBUTION]
test (self-hosted, Windows, hfenduleam)	Test — Phase B (heavy class, serialized, on a now-quiet box) — windows	2026-08-28T13:03:11.7869634Z     CONN_LIFECYCLE: conn=4 role=brain wall_ms=1787922190827 mono_ms=3029 event=write-start [REQ-CONN-POISON-ATTRIBUTION]
test (self-hosted, Windows, hfenduleam)	Test — Phase B (heavy class, serialized, on a now-quiet box) — windows	2026-08-28T13:03:11.7870496Z     CONN_LIFECYCLE: conn=4 role=brain wall_ms=1787922190828 mono_ms=3029 event=transport-close poisoned=false timed_out=false [REQ-CONN-POISON-ATTRIBUTION]
test (self-hosted, Windows, hfenduleam)	Test — Phase B (heavy class, serialized, on a now-quiet box) — windows	2026-08-28T13:03:11.7871211Z     PUMP_IPC_READER: spawned
test (self-hosted, Windows, hfenduleam)	Test — Phase B (heavy class, serialized, on a now-quiet box) — windows	2026-08-28T13:03:11.7871667Z     CONN_LIFECYCLE: conn=5 role=brain wall_ms=1787922190828 mono_ms=3030 event=write-start [REQ-CONN-POISON-ATTRIBUTION]
test (self-hosted, Windows, hfenduleam)	Test — Phase B (heavy class, serialized, on a now-quiet box) — windows	2026-08-28T13:03:11.7872623Z     CONN_LIFECYCLE: conn=5 role=brain stream-subscriber stream=4 wall_ms=1787922190853 mono_ms=3054 event=stream-sub-attach stream=4 from_seq=0 [REQ-CONN-POISON-ATTRIBUTION]
test (self-hosted, Windows, hfenduleam)	Test — Phase B (heavy class, serialized, on a now-quiet box) — windows	2026-08-28T13:03:11.7873566Z     CONN_LIFECYCLE: conn=6 role=brain wall_ms=1787922190853 mono_ms=3054 event=write-start [REQ-CONN-POISON-ATTRIBUTION]
test (self-hosted, Windows, hfenduleam)	Test — Phase B (heavy class, serialized, on a now-quiet box) — windows	2026-08-28T13:03:11.7874514Z     CONN_LIFECYCLE: conn=6 role=brain stream-subscriber stream=3 wall_ms=1787922190853 mono_ms=3055 event=stream-sub-attach stream=3 from_seq=0 [REQ-CONN-POISON-ATTRIBUTION]
test (self-hosted, Windows, hfenduleam)	Test — Phase B (heavy class, serialized, on a now-quiet box) — windows	2026-08-28T13:03:11.7877101Z     ACCESS_STORE_MINTED C:\actions-runner\_work\_temp\spt-test-tmp-33172022108-1-d12d5adc63dc4e078d13c47762a3448f\.tmpLMFZMA\home\identity\trust\access.json — no access store was present at first load in this process, so an EMPTY baseline was written (everything open that the chain leaves open). If this node had access rules, they are GONE: the store was removed while the daemon was down, and this mint replaced it. Re-apply them (`spt endpoint access ...`); a restart cannot tell a wipe from a first boot.
test (self-hosted, Windows, hfenduleam)	Test — Phase B (heavy class, serialized, on a now-quiet box) — windows	2026-08-28T13:03:11.7879210Z     ATTACH_INTENT_CHOSEN: site=serve_dispatch session=1 intent=viewer from_seq=0 gen=1787922190852 coded=false
test (self-hosted, Windows, hfenduleam)	Test — Phase B (heavy class, serialized, on a now-quiet box) — windows	2026-08-28T13:03:11.7880312Z     CONN_LIFECYCLE: conn=6 role=brain stream-subscriber stream=3 viewer session=1 endpoint=ack-deadlock-ep vid=0 wall_ms=1787922190855 mono_ms=3056 event=viewer-attach session=1 vid=0 from_seq=0 [REQ-CONN-POISON-ATTRIBUTION]
test (self-hosted, Windows, hfenduleam)	Test — Phase B (heavy class, serialized, on a now-quiet box) — windows	2026-08-28T13:03:11.7881859Z     SUBSCRIBE_DECISION: session=1 endpoint=ack-deadlock-ep by=abeb0bec231fb4092f705f2b24dd581c58233ca4ebd308176e85577d8e31f576 conn=6 intent=viewer old_by=- old_gen=0 req_gen=0 decision=viewer
test (self-hosted, Windows, hfenduleam)	Test — Phase B (heavy class, serialized, on a now-quiet box) — windows	2026-08-28T13:03:11.7883032Z     CONN_LIFECYCLE: conn=7 role=brain wall_ms=1787922190880 mono_ms=3082 event=transport-close poisoned=false timed_out=false [REQ-CONN-POISON-ATTRIBUTION]
test (self-hosted, Windows, hfenduleam)	Test — Phase B (heavy class, serialized, on a now-quiet box) — windows	2026-08-28T13:03:11.7884406Z     CONN_LIFECYCLE: conn=6 role=brain stream-subscriber stream=3 viewer session=1 endpoint=ack-deadlock-ep vid=0 wall_ms=1787922190880 mono_ms=3082 event=session-detach session=1 was_controller=false viewers_dropped=1 [REQ-CONN-POISON-ATTRIBUTION]
test (self-hosted, Windows, hfenduleam)	Test — Phase B (heavy class, serialized, on a now-quiet box) — windows	2026-08-28T13:03:11.7886022Z     CONN_LIFECYCLE: conn=6 role=brain stream-subscriber stream=3 viewer session=1 endpoint=ack-deadlock-ep vid=0 wall_ms=1787922190880 mono_ms=3082 event=writer-exit role=viewer session=1 reason=channel-closed [REQ-CONN-POISON-ATTRIBUTION]
test (self-hosted, Windows, hfenduleam)	Test — Phase B (heavy class, serialized, on a now-quiet box) — windows	2026-08-28T13:03:11.7886947Z     PUMP_IPC_READER: exited
test (self-hosted, Windows, hfenduleam)	Test — Phase B (heavy class, serialized, on a now-quiet box) — windows	2026-08-28T13:03:11.7887314Z     STREAM_CONNBOUND_RETIRE:4: opener conn exited — FIN + terminal retire
test (self-hosted, Windows, hfenduleam)	Test — Phase B (heavy class, serialized, on a now-quiet box) — windows	2026-08-28T13:03:11.7888130Z     CONN_LIFECYCLE: conn=5 role=brain stream-subscriber stream=4 wall_ms=1787922190880 mono_ms=3082 event=transport-close poisoned=false timed_out=false [REQ-CONN-POISON-ATTRIBUTION]
test (self-hosted, Windows, hfenduleam)	Test — Phase B (heavy class, serialized, on a now-quiet box) — windows	2026-08-28T13:03:11.7889483Z     CONN_LIFECYCLE: conn=6 role=brain stream-subscriber stream=3 viewer session=1 endpoint=ack-deadlock-ep vid=0 wall_ms=1787922190881 mono_ms=3082 event=transport-close poisoned=false timed_out=false [REQ-CONN-POISON-ATTRIBUTION]
test (self-hosted, Windows, hfenduleam)	Test — Phase B (heavy class, serialized, on a now-quiet box) — windows	2026-08-28T13:03:11.7890481Z     SPAWN_PHASE:ack-deadlock-ep phase=row_removed session=1 lived_ms=3225
test (self-hosted, Windows, hfenduleam)	Test — Phase B (heavy class, serialized, on a now-quiet box) — windows	2026-08-28T13:03:11.7892942Z     === P1b ACK-DEADLOCK GATE: flood_n=64 flood_verdict=SetupFailed: request_attach: brain IPC read deadline elapsed broker_alive(net_status)=true sessions_answered=true concurrent_attach_subscribed=true repaint_decodable=true post_flood_live_output=true (fixed = flood_verdict=Sent + broker_alive + sessions_answered + subscribed + repaint_decodable + post_flood_live_output true; pre-fix on a small-pipe/forkpty platform: the applied-ack stream fills the return direction → the per-conn handler deadlocks → flood watchdog times out.) ===
test (self-hosted, Windows, hfenduleam)	Test — Phase B (heavy class, serialized, on a now-quiet box) — windows	2026-08-28T13:03:11.7895033Z 
test (self-hosted, Windows, hfenduleam)	Test — Phase B (heavy class, serialized, on a now-quiet box) — windows	2026-08-28T13:03:11.7895511Z     thread 'input_flood_through_serve_attach_does_not_deadlock_broker' (42200) panicked at crates\spt-daemon\tests\input_ack_deadlock.rs:667:5:
test (self-hosted, Windows, hfenduleam)	Test — Phase B (heavy class, serialized, on a now-quiet box) — windows	2026-08-28T13:03:11.7899667Z     all 64 flooded input records must SEND through serve_attach; verdict=SetupFailed: request_attach: brain IPC read deadline elapsed. WatchdogTimeout means the pre-fix applied-ack stream filled the target brain↔broker return direction and the resulting full-duplex deadlock backed up the operator's own writes. SendFailed names the immediate write error and operation; HelperDisconnected means the flood helper exited without reporting (REQ-HAZARD-INPUT-ACK-BACKPRESSURE).
test (self-hosted, Windows, hfenduleam)	Test — Phase B (heavy class, serialized, on a now-quiet box) — windows	2026-08-28T13:03:11.7902222Z     note: run with `RUST_BACKTRACE=1` environment variable to display a backtrace
test (self-hosted, Windows, hfenduleam)	Test — Phase B (heavy class, serialized, on a now-quiet box) — windows	2026-08-28T13:03:11.7903322Z     CONN_WRITE_RETIRED: conn=1 role=brain controller session=1 endpoint=ack-deadlock-ep by=local wall_ms=1787922191769 mono_ms=3971 — organic write failure (BrokenPipe: The pipe is being closed. (os error 232)); physical broker conn poisoned + retired, never reused (same retire behavior as POISONED — only the failure class differs) [REQ-CONN-POISON-DIAL-SCOPE]
test (self-hosted, Windows, hfenduleam)	Test — Phase B (heavy class, serialized, on a now-quiet box) — windows	2026-08-28T13:03:11.7904636Z     CONN_LIFECYCLE: conn=1 role=brain controller session=1 endpoint=ack-deadlock-ep by=local wall_ms=1787922191769 mono_ms=3971 event=writer-exit role=controller session=1 reason=write-failed kind=BrokenPipe [REQ-CONN-POISON-ATTRIBUTION]
test (self-hosted, Windows, hfenduleam)	Test — Phase B (heavy class, serialized, on a now-quiet box) — windows	2026-08-28T13:03:11.7905509Z     CONN_LIFECYCLE: conn=1 role=brain controller session=1 endpoint=ack-deadlock-ep by=local wall_ms=1787922191769 mono_ms=3971 event=transport-close poisoned=true timed_out=false [REQ-CONN-POISON-ATTRIBUTION]
test (self-hosted, Windows, hfenduleam)	Test — Phase B (heavy class, serialized, on a now-quiet box) — windows	2026-08-28T13:03:11.7906101Z 
test (self-hosted, Windows, hfenduleam)	Test — Phase B (heavy class, serialized, on a now-quiet box) — windows	2026-08-28T13:03:21.1650367Z         PASS [   9.380s] (143/209) spt-daemon::mesh_recovery a_dead_roster_address_does_not_strand_the_peer_from_discovery
test (self-hosted, Windows, hfenduleam)	Test — Phase B (heavy class, serialized, on a now-quiet box) — windows	2026-08-28T13:03:21.3408374Z         PASS [   0.176s] (144/209) spt-daemon::mesh_recovery a_frozen_self_row_heals_at_boot_and_readvertises_the_live_address
test (self-hosted, Windows, hfenduleam)	Test — Phase B (heavy class, serialized, on a now-quiet box) — windows	2026-08-28T13:03:21.5245786Z         PASS [   0.184s] (145/209) spt-daemon::mesh_recovery health_degrades_during_all_peer_failure_and_recovers_on_real_progress
test (self-hosted, Windows, hfenduleam)	Test — Phase B (heavy class, serialized, on a now-quiet box) — windows	2026-08-28T13:03:23.3978808Z         PASS [   1.873s] (146/209) spt-daemon::mesh_recovery poison_cache_row_is_repaired_from_the_roster_at_startup
test (self-hosted, Windows, hfenduleam)	Test — Phase B (heavy class, serialized, on a now-quiet box) — windows	2026-08-28T13:03:30.1277857Z         PASS [   6.730s] (147/209) spt-daemon::mesh_recovery roster_route_survives_a_transient_dial_failure_with_discovery_disabled
test (self-hosted, Windows, hfenduleam)	Test — Phase B (heavy class, serialized, on a now-quiet box) — windows	2026-08-28T13:03:32.8090135Z         PASS [   2.681s] (148/209) spt-daemon::net_worker_starve dead_peer_dial_burst_vs_net_runtime_canary
test (self-hosted, Windows, hfenduleam)	Test — Phase B (heavy class, serialized, on a now-quiet box) — windows	2026-08-28T13:03:35.4592434Z         PASS [   2.650s] (149/209) spt-daemon::net_worker_starve unreachable_peer_dial_burst_vs_net_runtime_canary
test (self-hosted, Windows, hfenduleam)	Test — Phase B (heavy class, serialized, on a now-quiet box) — windows	2026-08-28T13:03:36.5545110Z         PASS [   1.095s] (150/209) spt-daemon::redispatch finished_historical_attach_neither_takes_nor_clears_current_controller
test (self-hosted, Windows, hfenduleam)	Test — Phase B (heavy class, serialized, on a now-quiet box) — windows	2026-08-28T13:03:37.0611451Z         PASS [   0.507s] (151/209) spt-daemon::redispatch finished_pending_sync_request_still_serves_across_generation_start
test (self-hosted, Windows, hfenduleam)	Test — Phase B (heavy class, serialized, on a now-quiet box) — windows	2026-08-28T13:03:41.6337873Z         PASS [   4.572s] (152/209) spt-daemon::redispatch finished_unretired_attach_is_skipped_and_drained_not_replayed
test (self-hosted, Windows, hfenduleam)	Test — Phase B (heavy class, serialized, on a now-quiet box) — windows	2026-08-28T13:03:42.2998617Z         PASS [   0.666s] (153/209) spt-daemon::redispatch opener_evicted_active_stream_resumes_after_dispatcher_restart
test (self-hosted, Windows, hfenduleam)	Test — Phase B (heavy class, serialized, on a now-quiet box) — windows	2026-08-28T13:03:42.9769838Z         PASS [   0.677s] (154/209) spt-daemon::redispatch transient_worker_start_failure_recovers_via_claim_retry
test (self-hosted, Windows, hfenduleam)	Test — Phase B (heavy class, serialized, on a now-quiet box) — windows	2026-08-28T13:03:43.2704469Z         PASS [   0.293s] (155/209) spt-daemon::redispatch_stall old_broker_unknown_verb_answer_falls_back_to_the_peek_and_serves_real_traffic
test (self-hosted, Windows, hfenduleam)	Test — Phase B (heavy class, serialized, on a now-quiet box) — windows	2026-08-28T13:03:48.0475092Z         PASS [   4.777s] (156/209) spt-daemon::redispatch_stall opener_transient_is_bounded_requeue_never_a_peek_subscriber
test (self-hosted, Windows, hfenduleam)	Test — Phase B (heavy class, serialized, on a now-quiet box) — windows	2026-08-28T13:03:50.1841035Z         PASS [   2.136s] (157/209) spt-daemon::redispatch_stall poisoned_subscriber_cancels_the_paired_forwarding_leg_then_recovery_serves
test (self-hosted, Windows, hfenduleam)	Test — Phase B (heavy class, serialized, on a now-quiet box) — windows	2026-08-28T13:03:52.7205790Z         PASS [   2.536s] (158/209) spt-daemon::redispatch_stall seat_blocked_failure_trips_the_breaker_and_the_stream_recovers
test (self-hosted, Windows, hfenduleam)	Test — Phase B (heavy class, serialized, on a now-quiet box) — windows	2026-08-28T13:03:57.4871848Z         PASS [   4.766s] (159/209) spt-daemon::redispatch_stall stale_unfinished_attach_replay_neither_takes_nor_clears_the_replacement_controller
test (self-hosted, Windows, hfenduleam)	Test — Phase B (heavy class, serialized, on a now-quiet box) — windows	2026-08-28T13:04:00.1895993Z         PASS [   2.702s] (160/209) spt-daemon::redispatch_stall wedged_subscriber_never_stalls_the_producer_and_recovery_replays_gapless
test (self-hosted, Windows, hfenduleam)	Test — Phase B (heavy class, serialized, on a now-quiet box) — windows	2026-08-28T13:04:00.4176774Z         PASS [   0.228s] (161/209) spt-daemon::registry_lifecycle multichunk_feed_applies_with_exactly_one_snapshot_write
test (self-hosted, Windows, hfenduleam)	Test — Phase B (heavy class, serialized, on a now-quiet box) — windows	2026-08-28T13:04:05.5836866Z         PASS [   5.166s] (162/209) spt-daemon::registry_lifecycle oneway_rounds_plateau_rows_seats_and_a_refresh_replays_nothing
test (self-hosted, Windows, hfenduleam)	Test — Phase B (heavy class, serialized, on a now-quiet box) — windows	2026-08-28T13:04:19.8190654Z         PASS [  14.235s] (163/209) spt-daemon::registry_lifecycle poisoned_registry_replay_strikes_out_terminal_while_fresh_feeds_serve
test (self-hosted, Windows, hfenduleam)	Test — Phase B (heavy class, serialized, on a now-quiet box) — windows	2026-08-28T13:04:20.2536525Z         PASS [   0.435s] (164/209) spt-daemon::render_lifecycle final_output_frame_precedes_exit_through_the_production_path
test (self-hosted, Windows, hfenduleam)	Test — Phase B (heavy class, serialized, on a now-quiet box) — windows	2026-08-28T13:04:24.5345942Z         PASS [   4.281s] (165/209) spt-daemon::resize_geometry_epoch a_real_conpty_grow_repaints_cell_for_cell_like_an_independent_authority
test (self-hosted, Windows, hfenduleam)	Test — Phase B (heavy class, serialized, on a now-quiet box) — windows	2026-08-28T13:04:28.9248494Z         PASS [   4.390s] (166/209) spt-daemon::resize_geometry_epoch a_real_conpty_shrink_repaints_cell_for_cell_like_an_independent_authority
test (self-hosted, Windows, hfenduleam)	Test — Phase B (heavy class, serialized, on a now-quiet box) — windows	2026-08-28T13:04:36.3741319Z         PASS [   7.449s] (167/209) spt-daemon::resize_presentation_barrier a_controller_resuming_across_the_transition_gets_the_repaint_never_raw
test (self-hosted, Windows, hfenduleam)	Test — Phase B (heavy class, serialized, on a now-quiet box) — windows	2026-08-28T13:04:43.2765383Z         PASS [   6.902s] (168/209) spt-daemon::resize_presentation_barrier a_live_controller_and_viewer_across_a_shrink_see_one_sync_frame_never_mixed_geometry
test (self-hosted, Windows, hfenduleam)	Test — Phase B (heavy class, serialized, on a now-quiet box) — windows	2026-08-28T13:04:53.7585654Z         PASS [  10.482s] (169/209) spt-daemon::restart_replay_lifetime a_raw_dead_connection_bound_opener_is_not_re_served_by_the_next_generation
test (self-hosted, Windows, hfenduleam)	Test — Phase B (heavy class, serialized, on a now-quiet box) — windows	2026-08-28T13:04:56.1892399Z         PASS [   2.429s] (170/209) spt-daemon::resume cold_start_resumes_all_sessions_from_the_broker_cursor
test (self-hosted, Windows, hfenduleam)	Test — Phase B (heavy class, serialized, on a now-quiet box) — windows	2026-08-28T13:05:00.5744926Z         PASS [   4.386s] (171/209) spt-daemon::resume resume_below_ring_floor_clamps_forward_without_gap_error
test (self-hosted, Windows, hfenduleam)	Test — Phase B (heavy class, serialized, on a now-quiet box) — windows	2026-08-28T13:05:02.3298427Z         PASS [   1.755s] (172/209) spt-daemon::resume resume_mode_brain_spawning_new_sessions_delivers_each
test (self-hosted, Windows, hfenduleam)	Test — Phase B (heavy class, serialized, on a now-quiet box) — windows	2026-08-28T13:05:02.6200117Z         PASS [   0.290s] (173/209) spt-daemon::shellchan hung_shell_stalls_no_other_owner
test (self-hosted, Windows, hfenduleam)	Test — Phase B (heavy class, serialized, on a now-quiet box) — windows	2026-08-28T13:05:02.8535343Z         PASS [   0.233s] (174/209) spt-daemon::shellchan stdin_receipt_delivers_spooled_frames_exactly_once
test (self-hosted, Windows, hfenduleam)	Test — Phase B (heavy class, serialized, on a now-quiet box) — windows	2026-08-28T13:05:02.9620815Z         PASS [   0.108s] (175/209) spt-daemon::spawn_truth concurrent_fresh_race_yields_one_created_one_conflict
test (self-hosted, Windows, hfenduleam)	Test — Phase B (heavy class, serialized, on a now-quiet box) — windows	2026-08-28T13:05:03.0414100Z         PASS [   0.079s] (176/209) spt-daemon::spawn_truth fresh_create_over_offline_raw_active_stale_ledger_creates
test (self-hosted, Windows, hfenduleam)	Test — Phase B (heavy class, serialized, on a now-quiet box) — windows	2026-08-28T13:05:03.1102462Z         PASS [   0.069s] (177/209) spt-daemon::spawn_truth fresh_over_live_is_a_typed_conflict_and_touches_nothing
test (self-hosted, Windows, hfenduleam)	Test — Phase B (heavy class, serialized, on a now-quiet box) — windows	2026-08-28T13:05:03.2021438Z         PASS [   0.092s] (178/209) spt-daemon::spawn_truth mixed_fresh_resume_race_never_two_children
test (self-hosted, Windows, hfenduleam)	Test — Phase B (heavy class, serialized, on a now-quiet box) — windows	2026-08-28T13:05:03.2234939Z         PASS [   0.021s] (179/209) spt-daemon::spawn_truth n1_broker_unknown_kind_fails_loud_never_created
test (self-hosted, Windows, hfenduleam)	Test — Phase B (heavy class, serialized, on a now-quiet box) — windows	2026-08-28T13:05:09.3331784Z         PASS [   6.110s] (180/209) spt-daemon::spawn_truth windows_run_never_refuses_over_a_dead_root_the_broker_holds_a_handle_to
test (self-hosted, Windows, hfenduleam)	Test — Phase B (heavy class, serialized, on a now-quiet box) — windows	2026-08-28T13:05:09.7904671Z         PASS [   0.457s] (181/209) spt-daemon::spawn_truth zombie_client_tree_is_reaped_and_run_succeeds_honestly
test (self-hosted, Windows, hfenduleam)	Test — Phase B (heavy class, serialized, on a now-quiet box) — windows	2026-08-28T13:06:09.8095661Z         SLOW [> 60.000s] (───────) spt-daemon::transport_death_eof transport_death_without_a_fin_surfaces_eof_to_the_serving_worker
test (self-hosted, Windows, hfenduleam)	Test — Phase B (heavy class, serialized, on a now-quiet box) — windows	2026-08-28T13:06:15.4476980Z         PASS [  65.657s] (182/209) spt-daemon::transport_death_eof transport_death_without_a_fin_surfaces_eof_to_the_serving_worker
test (self-hosted, Windows, hfenduleam)	Test — Phase B (heavy class, serialized, on a now-quiet box) — windows	2026-08-28T13:06:15.5879416Z         PASS [   0.140s] (183/209) spt-daemon::two_origin_spanning digest_span_supersedes_a_replayed_generation
test (self-hosted, Windows, hfenduleam)	Test — Phase B (heavy class, serialized, on a now-quiet box) — windows	2026-08-28T13:06:15.7554369Z         PASS [   0.167s] (184/209) spt-daemon::two_origin_spanning one_source_two_consumers_spans_and_merges
test (self-hosted, Windows, hfenduleam)	Test — Phase B (heavy class, serialized, on a now-quiet box) — windows	2026-08-28T13:06:15.7683499Z         PASS [   0.013s] (185/209) spt-daemon::twohost b2_attacher_child
test (self-hosted, Windows, hfenduleam)	Test — Phase B (heavy class, serialized, on a now-quiet box) — windows	2026-08-28T13:06:15.7790832Z         PASS [   0.011s] (186/209) spt-daemon::twohost two_host_ladder_role_a
test (self-hosted, Windows, hfenduleam)	Test — Phase B (heavy class, serialized, on a now-quiet box) — windows	2026-08-28T13:06:15.7902756Z         PASS [   0.011s] (187/209) spt-daemon::twohost two_host_ladder_role_b
test (self-hosted, Windows, hfenduleam)	Test — Phase B (heavy class, serialized, on a now-quiet box) — windows	2026-08-28T13:06:20.8235645Z         PASS [   5.033s] (188/209) spt-term::capture_vehicle_fidelity the_replay_vehicle_is_cell_transparent_with_dnar
test (self-hosted, Windows, hfenduleam)	Test — Phase B (heavy class, serialized, on a now-quiet box) — windows	2026-08-28T13:06:25.8500972Z         PASS [   5.026s] (189/209) spt-term::capture_vehicle_fidelity the_stock_console_vehicle_manufactures_the_field_string
test (self-hosted, Windows, hfenduleam)	Test — Phase B (heavy class, serialized, on a now-quiet box) — windows	2026-08-28T13:06:26.0472742Z         PASS [   0.197s] (190/209) spt-term::dsr conpty_output_not_withheld_under_the_drain
test (self-hosted, Windows, hfenduleam)	Test — Phase B (heavy class, serialized, on a now-quiet box) — windows	2026-08-28T13:06:26.0827118Z         PASS [   0.035s] (191/209) spt-term::dsr drain_forwards_child_output
test (self-hosted, Windows, hfenduleam)	Test — Phase B (heavy class, serialized, on a now-quiet box) — windows	2026-08-28T13:06:26.1299783Z         PASS [   0.047s] (192/209) spt-term::inject ctrl_c_interrupts_the_child
test (self-hosted, Windows, hfenduleam)	Test — Phase B (heavy class, serialized, on a now-quiet box) — windows	2026-08-28T13:06:26.1832210Z         PASS [   0.053s] (193/209) spt-term::inject send_line_reaches_child_and_preserves_order
test (self-hosted, Windows, hfenduleam)	Test — Phase B (heavy class, serialized, on a now-quiet box) — windows	2026-08-28T13:06:26.1980654Z         PASS [   0.015s] (194/209) spt-term::rc_console_newline_presentation a_bare_lf_is_an_index_in_a_spec_vt
test (self-hosted, Windows, hfenduleam)	Test — Phase B (heavy class, serialized, on a now-quiet box) — windows	2026-08-28T13:06:29.2199505Z         PASS [   3.022s] (195/209) spt-term::rc_console_newline_presentation rc_console_mode_today_column_resets_a_bare_lf
test (self-hosted, Windows, hfenduleam)	Test — Phase B (heavy class, serialized, on a now-quiet box) — windows	2026-08-28T13:06:32.2409861Z         PASS [   3.021s] (196/209) spt-term::rc_console_newline_presentation rc_console_mode_with_dnar_presents_what_the_emitter_addressed
test (self-hosted, Windows, hfenduleam)	Test — Phase B (heavy class, serialized, on a now-quiet box) — windows	2026-08-28T13:06:32.5085895Z         PASS [   0.268s] (197/209) spt-term::resize_console_mode_integrity a_surface_resize_does_not_alter_the_hosted_console_input_mode
test (self-hosted, Windows, hfenduleam)	Test — Phase B (heavy class, serialized, on a now-quiet box) — windows	2026-08-28T13:06:32.5175347Z         PASS [   0.009s] (198/209) spt-term::resize_console_mode_integrity the_probe_report_parses_out_of_a_re_rendered_stream
test (self-hosted, Windows, hfenduleam)	Test — Phase B (heavy class, serialized, on a now-quiet box) — windows	2026-08-28T13:06:32.6896365Z         PASS [   0.172s] (199/209) spt-term::resize_console_mode_integrity the_rig_detects_a_seeded_console_input_mode_change
test (self-hosted, Windows, hfenduleam)	Test — Phase B (heavy class, serialized, on a now-quiet box) — windows	2026-08-28T13:06:33.2118171Z         PASS [   0.522s] (200/209) spt-term::resize_console_mode_integrity typed_bytes_do_not_echo_back_as_output_after_a_resize
test (self-hosted, Windows, hfenduleam)	Test — Phase B (heavy class, serialized, on a now-quiet box) — windows	2026-08-28T13:06:33.2289083Z         PASS [   0.017s] (201/209) spt-term::screengrid_width_oracle combining_mark_zero_cell_survives_the_repaint
test (self-hosted, Windows, hfenduleam)	Test — Phase B (heavy class, serialized, on a now-quiet box) — windows	2026-08-28T13:06:33.2385650Z         PASS [   0.010s] (202/209) spt-term::screengrid_width_oracle cup_overwrite_after_wide_glyphs_lands_on_the_same_cells
test (self-hosted, Windows, hfenduleam)	Test — Phase B (heavy class, serialized, on a now-quiet box) — windows	2026-08-28T13:06:33.2477937Z         PASS [   0.009s] (203/209) spt-term::screengrid_width_oracle el_cleared_overflow_row_stays_blank_after_repaint
test (self-hosted, Windows, hfenduleam)	Test — Phase B (heavy class, serialized, on a now-quiet box) — windows	2026-08-28T13:06:33.2553836Z         PASS [   0.008s] (204/209) spt-term::screengrid_width_oracle ich_dch_erase_across_a_wide_half_leave_no_orphans
test (self-hosted, Windows, hfenduleam)	Test — Phase B (heavy class, serialized, on a now-quiet box) — windows	2026-08-28T13:06:33.2629868Z         PASS [   0.008s] (205/209) spt-term::screengrid_width_oracle wide_glyph_at_the_margin_fits_exactly_or_wraps_whole
test (self-hosted, Windows, hfenduleam)	Test — Phase B (heavy class, serialized, on a now-quiet box) — windows	2026-08-28T13:06:34.2916978Z         PASS [   1.029s] (206/209) spt-term::stream bounded_backpressure_stalls_an_unconsumed_reader
test (self-hosted, Windows, hfenduleam)	Test — Phase B (heavy class, serialized, on a now-quiet box) — windows	2026-08-28T13:06:34.3263531Z         PASS [   0.035s] (207/209) spt-term::stream delivers_every_value_under_resize
test (self-hosted, Windows, hfenduleam)	Test — Phase B (heavy class, serialized, on a now-quiet box) — windows	2026-08-28T13:06:34.3572457Z         PASS [   0.031s] (208/209) spt-term::surface resize_under_load_does_not_hang_or_panic
test (self-hosted, Windows, hfenduleam)	Test — Phase B (heavy class, serialized, on a now-quiet box) — windows	2026-08-28T13:06:34.3900054Z         PASS [   0.033s] (209/209) spt-term::winspawn pty_spawns_a_cmd_script_via_cmd_wrap
test (self-hosted, Windows, hfenduleam)	Test — Phase B (heavy class, serialized, on a now-quiet box) — windows	2026-08-28T13:06:34.3901053Z ────────────
test (self-hosted, Windows, hfenduleam)	Test — Phase B (heavy class, serialized, on a now-quiet box) — windows	2026-08-28T13:06:34.3901388Z      Summary [ 650.517s] 209 tests run: 208 passed (1 slow), 1 failed, 0 skipped
test (self-hosted, Windows, hfenduleam)	Test — Phase B (heavy class, serialized, on a now-quiet box) — windows	2026-08-28T13:06:34.3902346Z         FAIL [   4.380s] (142/209) spt-daemon::input_ack_deadlock input_flood_through_serve_attach_does_not_deadlock_broker
test (self-hosted, Windows, hfenduleam)	Test — Phase B (heavy class, serialized, on a now-quiet box) — windows	2026-08-28T13:06:34.3955577Z error: test run failed
test (self-hosted, Windows, hfenduleam)	Test — Phase B (heavy class, serialized, on a now-quiet box) — windows	2026-08-28T13:06:34.4408551Z ##[error]Process completed with exit code 1.
